Sie sind auf Seite 1von 20

Running "build" task

Running "karma:unit" (karma) task


INFO [karma]: Karma v0.12.24 server started at http://localhost:9876/
INFO [launcher]: Starting browser PhantomJS
WARN [watcher]: Pattern "/Users/vanessa/Documents/Angular/angularjs-web-componen
t-development-master/build/src/SmartButton/SmartButton.js" does not match any fi
le.
WARN [watcher]: Pattern "/Users/vanessa/Documents/Angular/angularjs-web-componen
t-development-master/build/src/MenuItem/MenuItem.js" does not match any file.
WARN [watcher]: Pattern "/Users/vanessa/Documents/Angular/angularjs-web-componen
t-development-master/build/src/Dropdown/Dropdown.js" does not match any file.
WARN [watcher]: Pattern "/Users/vanessa/Documents/Angular/angularjs-web-componen
t-development-master/build/src/Navbar/Navbar.js" does not match any file.
INFO [PhantomJS 1.9.8 (Mac OS X)]: Connected on socket OBlg9b_8KEby-8m0CDnl with
id 50113528
PhantomJS 1.9.8 (Mac OS X) My SmartButton component directive A smart button API
should use the attr value of "default-text" as the initially displayed bttn tex
t FAILED
Error: [$injector:modulerr] http://errors.angularjs.org/1.2.16/$injector
/modulerr?p0=UIComponents&p1=Error%3A%20%5B%24injector%3Amodulerr%5D%20http%3A%2
F%2Ferrors.angularjs.org%2F1.2.16%2F%24injector%2Fmodulerr%3Fp0%3DuiComponents.s
martButton%26p1%3DError%253A%2520%255B%2524injector%253Anomod%255D%2520http%253A
%252F%252Ferrors.angularjs.org%252F1.2.16%252F%2524injector%252Fnomod%253Fp0%253
DuiComponents.smartButton%250A%2520%2520%2520%2520at%2520http%253A%252F%252Floca
lhost%253A9876%252Fabsolute%252FUsers%252Fvanessa%252FDocuments%252FAngular%252F
angularjs-web-component-development-master%252Flib%252Fangular.min.js%253F5928dd
77b163848ff945444a16c470a343b6f96b%253A20%250A%2520%2520%2520%2520at%2520http%25
3A%252F%252Flocalhost%253A9876%252Fabsolute%252FUsers%252Fvanessa%252FDocuments%
252FAngular%252Fangularjs-web-component-development-master%252Flib%252Fangular.m
in.js%253F5928dd77b163848ff945444a16c470a343b6f96b%253A21%250A%2520%2520%2520%25
20at%2520http%253A%252F%252Flocalhost%253A9876%252Fabsolute%252FUsers%252Fvaness
a%252FDocuments%252FAngular%252Fangularjs-web-component-development-master%252Fl
ib%252Fangular.min.js%253F5928dd77b163848ff945444a16c470a343b6f96b%253A33%0A%20%
20%20%20at%20http%3A%2F%2Flocalhost%3A9876%2Fabsolute%2FUsers%2Fvanessa%2FDocume
nts%2FAngular%2Fangularjs-web-component-development-master%2Flib%2Fangular.min.j
s%3F5928dd77b163848ff945444a16c470a343b6f96b%3A33
at /Users/vanessa/Documents/Angular/angularjs-web-component-developm
ent-master/lib/angular.min.js:33
Error: [$injector:modulerr] http://errors.angularjs.org/1.2.16/$injector
/modulerr?p0=UIComponents&p1=Error%3A%20%5B%24injector%3Amodulerr%5D%20http%3A%2
F%2Ferrors.angularjs.org%2F1.2.16%2F%24injector%2Fmodulerr%3Fp0%3DuiComponents.s
martButton%26p1%3DError%253A%2520%255B%2524injector%253Anomod%255D%2520http%253A
%252F%252Ferrors.angularjs.org%252F1.2.16%252F%2524injector%252Fnomod%253Fp0%253
DuiComponents.smartButton%250A%2520%2520%2520%2520at%2520http%253A%252F%252Floca
lhost%253A9876%252Fabsolute%252FUsers%252Fvanessa%252FDocuments%252FAngular%252F
angularjs-web-component-development-master%252Flib%252Fangular.min.js%253F5928dd
77b163848ff945444a16c470a343b6f96b%253A20%250A%2520%2520%2520%2520at%2520http%25
3A%252F%252Flocalhost%253A9876%252Fabsolute%252FUsers%252Fvanessa%252FDocuments%
252FAngular%252Fangularjs-web-component-development-master%252Flib%252Fangular.m
in.js%253F5928dd77b163848ff945444a16c470a343b6f96b%253A21%250A%2520%2520%2520%25
20at%2520http%253A%252F%252Flocalhost%253A9876%252Fabsolute%252FUsers%252Fvaness
a%252FDocuments%252FAngular%252Fangularjs-web-component-development-master%252Fl
ib%252Fangular.min.js%253F5928dd77b163848ff945444a16c470a343b6f96b%253A33%0A%20%
20%20%20at%20http%3A%2F%2Flocalhost%3A9876%2Fabsolute%2FUsers%2Fvanessa%2FDocume
nts%2FAngular%2Fangularjs-web-component-development-master%2Flib%2Fangular.min.j
s%3F5928dd77b163848ff945444a16c470a343b6f96b%3A33
at /Users/vanessa/Documents/Angular/angularjs-web-component-developm
ent-master/lib/angular.min.js:33
TypeError: 'undefined' is not an object (evaluating 'haystack.indexOf')

at /Users/vanessa/Documents/Angular/angularjs-web-component-developm
ent-master/src/SmartButton/test/SmartButtonSpec.js:46
PhantomJS 1.9.8 (Mac OS X) My SmartButton component directive A smart button API
should use the attr value of "active-text" as what to display when clicked FAIL
ED
Error: [$injector:modulerr] http://errors.angularjs.org/1.2.16/$injector
/modulerr?p0=UIComponents&p1=Error%3A%20%5B%24injector%3Amodulerr%5D%20http%3A%2
F%2Ferrors.angularjs.org%2F1.2.16%2F%24injector%2Fmodulerr%3Fp0%3DuiComponents.s
martButton%26p1%3DError%253A%2520%255B%2524injector%253Anomod%255D%2520http%253A
%252F%252Ferrors.angularjs.org%252F1.2.16%252F%2524injector%252Fnomod%253Fp0%253
DuiComponents.smartButton%250A%2520%2520%2520%2520at%2520http%253A%252F%252Floca
lhost%253A9876%252Fabsolute%252FUsers%252Fvanessa%252FDocuments%252FAngular%252F
angularjs-web-component-development-master%252Flib%252Fangular.min.js%253F5928dd
77b163848ff945444a16c470a343b6f96b%253A20%250A%2520%2520%2520%2520at%2520http%25
3A%252F%252Flocalhost%253A9876%252Fabsolute%252FUsers%252Fvanessa%252FDocuments%
252FAngular%252Fangularjs-web-component-development-master%252Flib%252Fangular.m
in.js%253F5928dd77b163848ff945444a16c470a343b6f96b%253A21%250A%2520%2520%2520%25
20at%2520http%253A%252F%252Flocalhost%253A9876%252Fabsolute%252FUsers%252Fvaness
a%252FDocuments%252FAngular%252Fangularjs-web-component-development-master%252Fl
ib%252Fangular.min.js%253F5928dd77b163848ff945444a16c470a343b6f96b%253A33%0A%20%
20%20%20at%20http%3A%2F%2Flocalhost%3A9876%2Fabsolute%2FUsers%2Fvanessa%2FDocume
nts%2FAngular%2Fangularjs-web-component-development-master%2Flib%2Fangular.min.j
s%3F5928dd77b163848ff945444a16c470a343b6f96b%3A33
at /Users/vanessa/Documents/Angular/angularjs-web-component-developm
ent-master/lib/angular.min.js:33
Error: [$injector:modulerr] http://errors.angularjs.org/1.2.16/$injector
/modulerr?p0=UIComponents&p1=Error%3A%20%5B%24injector%3Amodulerr%5D%20http%3A%2
F%2Ferrors.angularjs.org%2F1.2.16%2F%24injector%2Fmodulerr%3Fp0%3DuiComponents.s
martButton%26p1%3DError%253A%2520%255B%2524injector%253Anomod%255D%2520http%253A
%252F%252Ferrors.angularjs.org%252F1.2.16%252F%2524injector%252Fnomod%253Fp0%253
DuiComponents.smartButton%250A%2520%2520%2520%2520at%2520http%253A%252F%252Floca
lhost%253A9876%252Fabsolute%252FUsers%252Fvanessa%252FDocuments%252FAngular%252F
angularjs-web-component-development-master%252Flib%252Fangular.min.js%253F5928dd
77b163848ff945444a16c470a343b6f96b%253A20%250A%2520%2520%2520%2520at%2520http%25
3A%252F%252Flocalhost%253A9876%252Fabsolute%252FUsers%252Fvanessa%252FDocuments%
252FAngular%252Fangularjs-web-component-development-master%252Flib%252Fangular.m
in.js%253F5928dd77b163848ff945444a16c470a343b6f96b%253A21%250A%2520%2520%2520%25
20at%2520http%253A%252F%252Flocalhost%253A9876%252Fabsolute%252FUsers%252Fvaness
a%252FDocuments%252FAngular%252Fangularjs-web-component-development-master%252Fl
ib%252Fangular.min.js%253F5928dd77b163848ff945444a16c470a343b6f96b%253A33%0A%20%
20%20%20at%20http%3A%2F%2Flocalhost%3A9876%2Fabsolute%2FUsers%2Fvanessa%2FDocume
nts%2FAngular%2Fangularjs-web-component-development-master%2Flib%2Fangular.min.j
s%3F5928dd77b163848ff945444a16c470a343b6f96b%3A33
at /Users/vanessa/Documents/Angular/angularjs-web-component-developm
ent-master/lib/angular.min.js:33
TypeError: 'undefined' is not an object (evaluating 'scope.bttnText')
at /Users/vanessa/Documents/Angular/angularjs-web-component-developm
ent-master/src/SmartButton/test/SmartButtonSpec.js:49
PhantomJS 1.9.8 (Mac OS X) My SmartButton component directive A smart button API
should transclude the content of the element FAILED
Error: [$injector:modulerr] http://errors.angularjs.org/1.2.16/$injector
/modulerr?p0=UIComponents&p1=Error%3A%20%5B%24injector%3Amodulerr%5D%20http%3A%2
F%2Ferrors.angularjs.org%2F1.2.16%2F%24injector%2Fmodulerr%3Fp0%3DuiComponents.s
martButton%26p1%3DError%253A%2520%255B%2524injector%253Anomod%255D%2520http%253A
%252F%252Ferrors.angularjs.org%252F1.2.16%252F%2524injector%252Fnomod%253Fp0%253
DuiComponents.smartButton%250A%2520%2520%2520%2520at%2520http%253A%252F%252Floca
lhost%253A9876%252Fabsolute%252FUsers%252Fvanessa%252FDocuments%252FAngular%252F
angularjs-web-component-development-master%252Flib%252Fangular.min.js%253F5928dd
77b163848ff945444a16c470a343b6f96b%253A20%250A%2520%2520%2520%2520at%2520http%25
3A%252F%252Flocalhost%253A9876%252Fabsolute%252FUsers%252Fvanessa%252FDocuments%

252FAngular%252Fangularjs-web-component-development-master%252Flib%252Fangular.m
in.js%253F5928dd77b163848ff945444a16c470a343b6f96b%253A21%250A%2520%2520%2520%25
20at%2520http%253A%252F%252Flocalhost%253A9876%252Fabsolute%252FUsers%252Fvaness
a%252FDocuments%252FAngular%252Fangularjs-web-component-development-master%252Fl
ib%252Fangular.min.js%253F5928dd77b163848ff945444a16c470a343b6f96b%253A33%0A%20%
20%20%20at%20http%3A%2F%2Flocalhost%3A9876%2Fabsolute%2FUsers%2Fvanessa%2FDocume
nts%2FAngular%2Fangularjs-web-component-development-master%2Flib%2Fangular.min.j
s%3F5928dd77b163848ff945444a16c470a343b6f96b%3A33
at /Users/vanessa/Documents/Angular/angularjs-web-component-developm
ent-master/lib/angular.min.js:33
Error: [$injector:modulerr] http://errors.angularjs.org/1.2.16/$injector
/modulerr?p0=UIComponents&p1=Error%3A%20%5B%24injector%3Amodulerr%5D%20http%3A%2
F%2Ferrors.angularjs.org%2F1.2.16%2F%24injector%2Fmodulerr%3Fp0%3DuiComponents.s
martButton%26p1%3DError%253A%2520%255B%2524injector%253Anomod%255D%2520http%253A
%252F%252Ferrors.angularjs.org%252F1.2.16%252F%2524injector%252Fnomod%253Fp0%253
DuiComponents.smartButton%250A%2520%2520%2520%2520at%2520http%253A%252F%252Floca
lhost%253A9876%252Fabsolute%252FUsers%252Fvanessa%252FDocuments%252FAngular%252F
angularjs-web-component-development-master%252Flib%252Fangular.min.js%253F5928dd
77b163848ff945444a16c470a343b6f96b%253A20%250A%2520%2520%2520%2520at%2520http%25
3A%252F%252Flocalhost%253A9876%252Fabsolute%252FUsers%252Fvanessa%252FDocuments%
252FAngular%252Fangularjs-web-component-development-master%252Flib%252Fangular.m
in.js%253F5928dd77b163848ff945444a16c470a343b6f96b%253A21%250A%2520%2520%2520%25
20at%2520http%253A%252F%252Flocalhost%253A9876%252Fabsolute%252FUsers%252Fvaness
a%252FDocuments%252FAngular%252Fangularjs-web-component-development-master%252Fl
ib%252Fangular.min.js%253F5928dd77b163848ff945444a16c470a343b6f96b%253A33%0A%20%
20%20%20at%20http%3A%2F%2Flocalhost%3A9876%2Fabsolute%2FUsers%2Fvanessa%2FDocume
nts%2FAngular%2Fangularjs-web-component-development-master%2Flib%2Fangular.min.j
s%3F5928dd77b163848ff945444a16c470a343b6f96b%3A33
at /Users/vanessa/Documents/Angular/angularjs-web-component-developm
ent-master/lib/angular.min.js:33
TypeError: 'undefined' is not an object (evaluating 'haystack.indexOf')
at /Users/vanessa/Documents/Angular/angularjs-web-component-developm
ent-master/src/SmartButton/test/SmartButtonSpec.js:54
PhantomJS 1.9.8 (Mac OS X) My SmartButton component directive A smart button API
should have the injected logic available for execution FAILED
Error: [$injector:modulerr] http://errors.angularjs.org/1.2.16/$injector
/modulerr?p0=UIComponents&p1=Error%3A%20%5B%24injector%3Amodulerr%5D%20http%3A%2
F%2Ferrors.angularjs.org%2F1.2.16%2F%24injector%2Fmodulerr%3Fp0%3DuiComponents.s
martButton%26p1%3DError%253A%2520%255B%2524injector%253Anomod%255D%2520http%253A
%252F%252Ferrors.angularjs.org%252F1.2.16%252F%2524injector%252Fnomod%253Fp0%253
DuiComponents.smartButton%250A%2520%2520%2520%2520at%2520http%253A%252F%252Floca
lhost%253A9876%252Fabsolute%252FUsers%252Fvanessa%252FDocuments%252FAngular%252F
angularjs-web-component-development-master%252Flib%252Fangular.min.js%253F5928dd
77b163848ff945444a16c470a343b6f96b%253A20%250A%2520%2520%2520%2520at%2520http%25
3A%252F%252Flocalhost%253A9876%252Fabsolute%252FUsers%252Fvanessa%252FDocuments%
252FAngular%252Fangularjs-web-component-development-master%252Flib%252Fangular.m
in.js%253F5928dd77b163848ff945444a16c470a343b6f96b%253A21%250A%2520%2520%2520%25
20at%2520http%253A%252F%252Flocalhost%253A9876%252Fabsolute%252FUsers%252Fvaness
a%252FDocuments%252FAngular%252Fangularjs-web-component-development-master%252Fl
ib%252Fangular.min.js%253F5928dd77b163848ff945444a16c470a343b6f96b%253A33%0A%20%
20%20%20at%20http%3A%2F%2Flocalhost%3A9876%2Fabsolute%2FUsers%2Fvanessa%2FDocume
nts%2FAngular%2Fangularjs-web-component-development-master%2Flib%2Fangular.min.j
s%3F5928dd77b163848ff945444a16c470a343b6f96b%3A33
at /Users/vanessa/Documents/Angular/angularjs-web-component-developm
ent-master/lib/angular.min.js:33
Error: [$injector:modulerr] http://errors.angularjs.org/1.2.16/$injector
/modulerr?p0=UIComponents&p1=Error%3A%20%5B%24injector%3Amodulerr%5D%20http%3A%2
F%2Ferrors.angularjs.org%2F1.2.16%2F%24injector%2Fmodulerr%3Fp0%3DuiComponents.s
martButton%26p1%3DError%253A%2520%255B%2524injector%253Anomod%255D%2520http%253A
%252F%252Ferrors.angularjs.org%252F1.2.16%252F%2524injector%252Fnomod%253Fp0%253

DuiComponents.smartButton%250A%2520%2520%2520%2520at%2520http%253A%252F%252Floca
lhost%253A9876%252Fabsolute%252FUsers%252Fvanessa%252FDocuments%252FAngular%252F
angularjs-web-component-development-master%252Flib%252Fangular.min.js%253F5928dd
77b163848ff945444a16c470a343b6f96b%253A20%250A%2520%2520%2520%2520at%2520http%25
3A%252F%252Flocalhost%253A9876%252Fabsolute%252FUsers%252Fvanessa%252FDocuments%
252FAngular%252Fangularjs-web-component-development-master%252Flib%252Fangular.m
in.js%253F5928dd77b163848ff945444a16c470a343b6f96b%253A21%250A%2520%2520%2520%25
20at%2520http%253A%252F%252Flocalhost%253A9876%252Fabsolute%252FUsers%252Fvaness
a%252FDocuments%252FAngular%252Fangularjs-web-component-development-master%252Fl
ib%252Fangular.min.js%253F5928dd77b163848ff945444a16c470a343b6f96b%253A33%0A%20%
20%20%20at%20http%3A%2F%2Flocalhost%3A9876%2Fabsolute%2FUsers%2Fvanessa%2FDocume
nts%2FAngular%2Fangularjs-web-component-development-master%2Flib%2Fangular.min.j
s%3F5928dd77b163848ff945444a16c470a343b6f96b%3A33
at /Users/vanessa/Documents/Angular/angularjs-web-component-developm
ent-master/lib/angular.min.js:33
TypeError: 'undefined' is not an object (evaluating 'scope.debug')
at /Users/vanessa/Documents/Angular/angularjs-web-component-developm
ent-master/src/SmartButton/test/SmartButtonSpec.js:57
PhantomJS 1.9.8 (Mac OS X) My SmartButton component directive A smart button API
should emit any events as APIs FAILED
Error: [$injector:modulerr] http://errors.angularjs.org/1.2.16/$injector
/modulerr?p0=UIComponents&p1=Error%3A%20%5B%24injector%3Amodulerr%5D%20http%3A%2
F%2Ferrors.angularjs.org%2F1.2.16%2F%24injector%2Fmodulerr%3Fp0%3DuiComponents.s
martButton%26p1%3DError%253A%2520%255B%2524injector%253Anomod%255D%2520http%253A
%252F%252Ferrors.angularjs.org%252F1.2.16%252F%2524injector%252Fnomod%253Fp0%253
DuiComponents.smartButton%250A%2520%2520%2520%2520at%2520http%253A%252F%252Floca
lhost%253A9876%252Fabsolute%252FUsers%252Fvanessa%252FDocuments%252FAngular%252F
angularjs-web-component-development-master%252Flib%252Fangular.min.js%253F5928dd
77b163848ff945444a16c470a343b6f96b%253A20%250A%2520%2520%2520%2520at%2520http%25
3A%252F%252Flocalhost%253A9876%252Fabsolute%252FUsers%252Fvanessa%252FDocuments%
252FAngular%252Fangularjs-web-component-development-master%252Flib%252Fangular.m
in.js%253F5928dd77b163848ff945444a16c470a343b6f96b%253A21%250A%2520%2520%2520%25
20at%2520http%253A%252F%252Flocalhost%253A9876%252Fabsolute%252FUsers%252Fvaness
a%252FDocuments%252FAngular%252Fangularjs-web-component-development-master%252Fl
ib%252Fangular.min.js%253F5928dd77b163848ff945444a16c470a343b6f96b%253A33%0A%20%
20%20%20at%20http%3A%2F%2Flocalhost%3A9876%2Fabsolute%2FUsers%2Fvanessa%2FDocume
nts%2FAngular%2Fangularjs-web-component-development-master%2Flib%2Fangular.min.j
s%3F5928dd77b163848ff945444a16c470a343b6f96b%3A33
at /Users/vanessa/Documents/Angular/angularjs-web-component-developm
ent-master/lib/angular.min.js:33
Error: [$injector:modulerr] http://errors.angularjs.org/1.2.16/$injector
/modulerr?p0=UIComponents&p1=Error%3A%20%5B%24injector%3Amodulerr%5D%20http%3A%2
F%2Ferrors.angularjs.org%2F1.2.16%2F%24injector%2Fmodulerr%3Fp0%3DuiComponents.s
martButton%26p1%3DError%253A%2520%255B%2524injector%253Anomod%255D%2520http%253A
%252F%252Ferrors.angularjs.org%252F1.2.16%252F%2524injector%252Fnomod%253Fp0%253
DuiComponents.smartButton%250A%2520%2520%2520%2520at%2520http%253A%252F%252Floca
lhost%253A9876%252Fabsolute%252FUsers%252Fvanessa%252FDocuments%252FAngular%252F
angularjs-web-component-development-master%252Flib%252Fangular.min.js%253F5928dd
77b163848ff945444a16c470a343b6f96b%253A20%250A%2520%2520%2520%2520at%2520http%25
3A%252F%252Flocalhost%253A9876%252Fabsolute%252FUsers%252Fvanessa%252FDocuments%
252FAngular%252Fangularjs-web-component-development-master%252Flib%252Fangular.m
in.js%253F5928dd77b163848ff945444a16c470a343b6f96b%253A21%250A%2520%2520%2520%25
20at%2520http%253A%252F%252Flocalhost%253A9876%252Fabsolute%252FUsers%252Fvaness
a%252FDocuments%252FAngular%252Fangularjs-web-component-development-master%252Fl
ib%252Fangular.min.js%253F5928dd77b163848ff945444a16c470a343b6f96b%253A33%0A%20%
20%20%20at%20http%3A%2F%2Flocalhost%3A9876%2Fabsolute%2FUsers%2Fvanessa%2FDocume
nts%2FAngular%2Fangularjs-web-component-development-master%2Flib%2Fangular.min.j
s%3F5928dd77b163848ff945444a16c470a343b6f96b%3A33
at /Users/vanessa/Documents/Angular/angularjs-web-component-developm
ent-master/lib/angular.min.js:33

spyOn could not find an object to spy upon for $emit()


PhantomJS 1.9.8 (Mac OS X) My SmartButton component directive A smart button API
should listen and handle any events as APIs FAILED
Error: [$injector:modulerr] http://errors.angularjs.org/1.2.16/$injector
/modulerr?p0=UIComponents&p1=Error%3A%20%5B%24injector%3Amodulerr%5D%20http%3A%2
F%2Ferrors.angularjs.org%2F1.2.16%2F%24injector%2Fmodulerr%3Fp0%3DuiComponents.s
martButton%26p1%3DError%253A%2520%255B%2524injector%253Anomod%255D%2520http%253A
%252F%252Ferrors.angularjs.org%252F1.2.16%252F%2524injector%252Fnomod%253Fp0%253
DuiComponents.smartButton%250A%2520%2520%2520%2520at%2520http%253A%252F%252Floca
lhost%253A9876%252Fabsolute%252FUsers%252Fvanessa%252FDocuments%252FAngular%252F
angularjs-web-component-development-master%252Flib%252Fangular.min.js%253F5928dd
77b163848ff945444a16c470a343b6f96b%253A20%250A%2520%2520%2520%2520at%2520http%25
3A%252F%252Flocalhost%253A9876%252Fabsolute%252FUsers%252Fvanessa%252FDocuments%
252FAngular%252Fangularjs-web-component-development-master%252Flib%252Fangular.m
in.js%253F5928dd77b163848ff945444a16c470a343b6f96b%253A21%250A%2520%2520%2520%25
20at%2520http%253A%252F%252Flocalhost%253A9876%252Fabsolute%252FUsers%252Fvaness
a%252FDocuments%252FAngular%252Fangularjs-web-component-development-master%252Fl
ib%252Fangular.min.js%253F5928dd77b163848ff945444a16c470a343b6f96b%253A33%0A%20%
20%20%20at%20http%3A%2F%2Flocalhost%3A9876%2Fabsolute%2FUsers%2Fvanessa%2FDocume
nts%2FAngular%2Fangularjs-web-component-development-master%2Flib%2Fangular.min.j
s%3F5928dd77b163848ff945444a16c470a343b6f96b%3A33
at /Users/vanessa/Documents/Angular/angularjs-web-component-developm
ent-master/lib/angular.min.js:33
Error: [$injector:modulerr] http://errors.angularjs.org/1.2.16/$injector
/modulerr?p0=UIComponents&p1=Error%3A%20%5B%24injector%3Amodulerr%5D%20http%3A%2
F%2Ferrors.angularjs.org%2F1.2.16%2F%24injector%2Fmodulerr%3Fp0%3DuiComponents.s
martButton%26p1%3DError%253A%2520%255B%2524injector%253Anomod%255D%2520http%253A
%252F%252Ferrors.angularjs.org%252F1.2.16%252F%2524injector%252Fnomod%253Fp0%253
DuiComponents.smartButton%250A%2520%2520%2520%2520at%2520http%253A%252F%252Floca
lhost%253A9876%252Fabsolute%252FUsers%252Fvanessa%252FDocuments%252FAngular%252F
angularjs-web-component-development-master%252Flib%252Fangular.min.js%253F5928dd
77b163848ff945444a16c470a343b6f96b%253A20%250A%2520%2520%2520%2520at%2520http%25
3A%252F%252Flocalhost%253A9876%252Fabsolute%252FUsers%252Fvanessa%252FDocuments%
252FAngular%252Fangularjs-web-component-development-master%252Flib%252Fangular.m
in.js%253F5928dd77b163848ff945444a16c470a343b6f96b%253A21%250A%2520%2520%2520%25
20at%2520http%253A%252F%252Flocalhost%253A9876%252Fabsolute%252FUsers%252Fvaness
a%252FDocuments%252FAngular%252Fangularjs-web-component-development-master%252Fl
ib%252Fangular.min.js%253F5928dd77b163848ff945444a16c470a343b6f96b%253A33%0A%20%
20%20%20at%20http%3A%2F%2Flocalhost%3A9876%2Fabsolute%2FUsers%2Fvanessa%2FDocume
nts%2FAngular%2Fangularjs-web-component-development-master%2Flib%2Fangular.min.j
s%3F5928dd77b163848ff945444a16c470a343b6f96b%3A33
at /Users/vanessa/Documents/Angular/angularjs-web-component-developm
ent-master/lib/angular.min.js:33
TypeError: 'undefined' is not an object (evaluating '$rootScope.$broadca
st')
at /Users/vanessa/Documents/Angular/angularjs-web-component-developm
ent-master/src/SmartButton/test/SmartButtonSpec.js:65
PhantomJS 1.9.8 (Mac OS X) My MenuItem component directive Menu Item Component A
PI coverage should use the attr value (API) of "text" as the menu label FAILED
Error: [$injector:modulerr] http://errors.angularjs.org/1.2.16/$injector
/modulerr?p0=uiComponents.menuItem&p1=Error%3A%20%5B%24injector%3Anomod%5D%20htt
p%3A%2F%2Ferrors.angularjs.org%2F1.2.16%2F%24injector%2Fnomod%3Fp0%3DuiComponent
s.menuItem%0A%20%20%20%20at%20http%3A%2F%2Flocalhost%3A9876%2Fabsolute%2FUsers%2
Fvanessa%2FDocuments%2FAngular%2Fangularjs-web-component-development-master%2Fli
b%2Fangular.min.js%3F5928dd77b163848ff945444a16c470a343b6f96b%3A20%0A%20%20%20%2
0at%20http%3A%2F%2Flocalhost%3A9876%2Fabsolute%2FUsers%2Fvanessa%2FDocuments%2FA
ngular%2Fangularjs-web-component-development-master%2Flib%2Fangular.min.js%3F592
8dd77b163848ff945444a16c470a343b6f96b%3A21%0A%20%20%20%20at%20http%3A%2F%2Flocal
host%3A9876%2Fabsolute%2FUsers%2Fvanessa%2FDocuments%2FAngular%2Fangularjs-web-c
omponent-development-master%2Flib%2Fangular.min.js%3F5928dd77b163848ff945444a16c

470a343b6f96b%3A33
at /Users/vanessa/Documents/Angular/angularjs-web-component-developm
ent-master/lib/angular.min.js:33
Error: [$injector:modulerr] http://errors.angularjs.org/1.2.16/$injector
/modulerr?p0=uiComponents.menuItem&p1=Error%3A%20%5B%24injector%3Anomod%5D%20htt
p%3A%2F%2Ferrors.angularjs.org%2F1.2.16%2F%24injector%2Fnomod%3Fp0%3DuiComponent
s.menuItem%0A%20%20%20%20at%20http%3A%2F%2Flocalhost%3A9876%2Fabsolute%2FUsers%2
Fvanessa%2FDocuments%2FAngular%2Fangularjs-web-component-development-master%2Fli
b%2Fangular.min.js%3F5928dd77b163848ff945444a16c470a343b6f96b%3A20%0A%20%20%20%2
0at%20http%3A%2F%2Flocalhost%3A9876%2Fabsolute%2FUsers%2Fvanessa%2FDocuments%2FA
ngular%2Fangularjs-web-component-development-master%2Flib%2Fangular.min.js%3F592
8dd77b163848ff945444a16c470a343b6f96b%3A21%0A%20%20%20%20at%20http%3A%2F%2Flocal
host%3A9876%2Fabsolute%2FUsers%2Fvanessa%2FDocuments%2FAngular%2Fangularjs-web-c
omponent-development-master%2Flib%2Fangular.min.js%3F5928dd77b163848ff945444a16c
470a343b6f96b%3A33
at /Users/vanessa/Documents/Angular/angularjs-web-component-developm
ent-master/lib/angular.min.js:33
TypeError: 'undefined' is not an object (evaluating 'haystack.indexOf')
at /Users/vanessa/Documents/Angular/angularjs-web-component-developm
ent-master/src/MenuItem/test/MenuItemSpec.js:44
PhantomJS 1.9.8 (Mac OS X) My MenuItem component directive Menu Item Component A
PI coverage should use the attr value (API) of "url" for the href url FAILED
Error: [$injector:modulerr] http://errors.angularjs.org/1.2.16/$injector
/modulerr?p0=uiComponents.menuItem&p1=Error%3A%20%5B%24injector%3Anomod%5D%20htt
p%3A%2F%2Ferrors.angularjs.org%2F1.2.16%2F%24injector%2Fnomod%3Fp0%3DuiComponent
s.menuItem%0A%20%20%20%20at%20http%3A%2F%2Flocalhost%3A9876%2Fabsolute%2FUsers%2
Fvanessa%2FDocuments%2FAngular%2Fangularjs-web-component-development-master%2Fli
b%2Fangular.min.js%3F5928dd77b163848ff945444a16c470a343b6f96b%3A20%0A%20%20%20%2
0at%20http%3A%2F%2Flocalhost%3A9876%2Fabsolute%2FUsers%2Fvanessa%2FDocuments%2FA
ngular%2Fangularjs-web-component-development-master%2Flib%2Fangular.min.js%3F592
8dd77b163848ff945444a16c470a343b6f96b%3A21%0A%20%20%20%20at%20http%3A%2F%2Flocal
host%3A9876%2Fabsolute%2FUsers%2Fvanessa%2FDocuments%2FAngular%2Fangularjs-web-c
omponent-development-master%2Flib%2Fangular.min.js%3F5928dd77b163848ff945444a16c
470a343b6f96b%3A33
at /Users/vanessa/Documents/Angular/angularjs-web-component-developm
ent-master/lib/angular.min.js:33
Error: [$injector:modulerr] http://errors.angularjs.org/1.2.16/$injector
/modulerr?p0=uiComponents.menuItem&p1=Error%3A%20%5B%24injector%3Anomod%5D%20htt
p%3A%2F%2Ferrors.angularjs.org%2F1.2.16%2F%24injector%2Fnomod%3Fp0%3DuiComponent
s.menuItem%0A%20%20%20%20at%20http%3A%2F%2Flocalhost%3A9876%2Fabsolute%2FUsers%2
Fvanessa%2FDocuments%2FAngular%2Fangularjs-web-component-development-master%2Fli
b%2Fangular.min.js%3F5928dd77b163848ff945444a16c470a343b6f96b%3A20%0A%20%20%20%2
0at%20http%3A%2F%2Flocalhost%3A9876%2Fabsolute%2FUsers%2Fvanessa%2FDocuments%2FA
ngular%2Fangularjs-web-component-development-master%2Flib%2Fangular.min.js%3F592
8dd77b163848ff945444a16c470a343b6f96b%3A21%0A%20%20%20%20at%20http%3A%2F%2Flocal
host%3A9876%2Fabsolute%2FUsers%2Fvanessa%2FDocuments%2FAngular%2Fangularjs-web-c
omponent-development-master%2Flib%2Fangular.min.js%3F5928dd77b163848ff945444a16c
470a343b6f96b%3A33
at /Users/vanessa/Documents/Angular/angularjs-web-component-developm
ent-master/lib/angular.min.js:33
TypeError: 'undefined' is not an object (evaluating 'haystack.indexOf')
at /Users/vanessa/Documents/Angular/angularjs-web-component-developm
ent-master/src/MenuItem/test/MenuItemSpec.js:47
PhantomJS 1.9.8 (Mac OS X) My MenuItem component directive Menu Item Component A
PI coverage should emit a "menu-item-selected" event (API) as when selected FAIL
ED
Error: [$injector:modulerr] http://errors.angularjs.org/1.2.16/$injector
/modulerr?p0=uiComponents.menuItem&p1=Error%3A%20%5B%24injector%3Anomod%5D%20htt
p%3A%2F%2Ferrors.angularjs.org%2F1.2.16%2F%24injector%2Fnomod%3Fp0%3DuiComponent
s.menuItem%0A%20%20%20%20at%20http%3A%2F%2Flocalhost%3A9876%2Fabsolute%2FUsers%2

Fvanessa%2FDocuments%2FAngular%2Fangularjs-web-component-development-master%2Fli
b%2Fangular.min.js%3F5928dd77b163848ff945444a16c470a343b6f96b%3A20%0A%20%20%20%2
0at%20http%3A%2F%2Flocalhost%3A9876%2Fabsolute%2FUsers%2Fvanessa%2FDocuments%2FA
ngular%2Fangularjs-web-component-development-master%2Flib%2Fangular.min.js%3F592
8dd77b163848ff945444a16c470a343b6f96b%3A21%0A%20%20%20%20at%20http%3A%2F%2Flocal
host%3A9876%2Fabsolute%2FUsers%2Fvanessa%2FDocuments%2FAngular%2Fangularjs-web-c
omponent-development-master%2Flib%2Fangular.min.js%3F5928dd77b163848ff945444a16c
470a343b6f96b%3A33
at /Users/vanessa/Documents/Angular/angularjs-web-component-developm
ent-master/lib/angular.min.js:33
Error: [$injector:modulerr] http://errors.angularjs.org/1.2.16/$injector
/modulerr?p0=uiComponents.menuItem&p1=Error%3A%20%5B%24injector%3Anomod%5D%20htt
p%3A%2F%2Ferrors.angularjs.org%2F1.2.16%2F%24injector%2Fnomod%3Fp0%3DuiComponent
s.menuItem%0A%20%20%20%20at%20http%3A%2F%2Flocalhost%3A9876%2Fabsolute%2FUsers%2
Fvanessa%2FDocuments%2FAngular%2Fangularjs-web-component-development-master%2Fli
b%2Fangular.min.js%3F5928dd77b163848ff945444a16c470a343b6f96b%3A20%0A%20%20%20%2
0at%20http%3A%2F%2Flocalhost%3A9876%2Fabsolute%2FUsers%2Fvanessa%2FDocuments%2FA
ngular%2Fangularjs-web-component-development-master%2Flib%2Fangular.min.js%3F592
8dd77b163848ff945444a16c470a343b6f96b%3A21%0A%20%20%20%20at%20http%3A%2F%2Flocal
host%3A9876%2Fabsolute%2FUsers%2Fvanessa%2FDocuments%2FAngular%2Fangularjs-web-c
omponent-development-master%2Flib%2Fangular.min.js%3F5928dd77b163848ff945444a16c
470a343b6f96b%3A33
at /Users/vanessa/Documents/Angular/angularjs-web-component-developm
ent-master/lib/angular.min.js:33
spyOn could not find an object to spy upon for $emit()
PhantomJS 1.9.8 (Mac OS X) My MenuItem component directive Menu Item Component o
ther functionality should add a "disabled" class if there is no URL provided FAI
LED
Error: [$injector:modulerr] http://errors.angularjs.org/1.2.16/$injector
/modulerr?p0=uiComponents.menuItem&p1=Error%3A%20%5B%24injector%3Anomod%5D%20htt
p%3A%2F%2Ferrors.angularjs.org%2F1.2.16%2F%24injector%2Fnomod%3Fp0%3DuiComponent
s.menuItem%0A%20%20%20%20at%20http%3A%2F%2Flocalhost%3A9876%2Fabsolute%2FUsers%2
Fvanessa%2FDocuments%2FAngular%2Fangularjs-web-component-development-master%2Fli
b%2Fangular.min.js%3F5928dd77b163848ff945444a16c470a343b6f96b%3A20%0A%20%20%20%2
0at%20http%3A%2F%2Flocalhost%3A9876%2Fabsolute%2FUsers%2Fvanessa%2FDocuments%2FA
ngular%2Fangularjs-web-component-development-master%2Flib%2Fangular.min.js%3F592
8dd77b163848ff945444a16c470a343b6f96b%3A21%0A%20%20%20%20at%20http%3A%2F%2Flocal
host%3A9876%2Fabsolute%2FUsers%2Fvanessa%2FDocuments%2FAngular%2Fangularjs-web-c
omponent-development-master%2Flib%2Fangular.min.js%3F5928dd77b163848ff945444a16c
470a343b6f96b%3A33
at /Users/vanessa/Documents/Angular/angularjs-web-component-developm
ent-master/lib/angular.min.js:33
Error: [$injector:modulerr] http://errors.angularjs.org/1.2.16/$injector
/modulerr?p0=uiComponents.menuItem&p1=Error%3A%20%5B%24injector%3Anomod%5D%20htt
p%3A%2F%2Ferrors.angularjs.org%2F1.2.16%2F%24injector%2Fnomod%3Fp0%3DuiComponent
s.menuItem%0A%20%20%20%20at%20http%3A%2F%2Flocalhost%3A9876%2Fabsolute%2FUsers%2
Fvanessa%2FDocuments%2FAngular%2Fangularjs-web-component-development-master%2Fli
b%2Fangular.min.js%3F5928dd77b163848ff945444a16c470a343b6f96b%3A20%0A%20%20%20%2
0at%20http%3A%2F%2Flocalhost%3A9876%2Fabsolute%2FUsers%2Fvanessa%2FDocuments%2FA
ngular%2Fangularjs-web-component-development-master%2Flib%2Fangular.min.js%3F592
8dd77b163848ff945444a16c470a343b6f96b%3A21%0A%20%20%20%20at%20http%3A%2F%2Flocal
host%3A9876%2Fabsolute%2FUsers%2Fvanessa%2FDocuments%2FAngular%2Fangularjs-web-c
omponent-development-master%2Flib%2Fangular.min.js%3F5928dd77b163848ff945444a16c
470a343b6f96b%3A33
at /Users/vanessa/Documents/Angular/angularjs-web-component-developm
ent-master/lib/angular.min.js:33
TypeError: 'undefined' is not an object (evaluating '$element.hasClass')
at /Users/vanessa/Documents/Angular/angularjs-web-component-developm
ent-master/src/MenuItem/test/MenuItemSpec.js:64
PhantomJS 1.9.8 (Mac OS X) My Dropdown component directive Dropdown Component ma

rkup API coverage should use the attr value (API) of "text" as the dropdown labe
l FAILED
Error: [$injector:modulerr] http://errors.angularjs.org/1.2.16/$injector
/modulerr?p0=uiComponents.dropdown&p1=Error%3A%20%5B%24injector%3Anomod%5D%20htt
p%3A%2F%2Ferrors.angularjs.org%2F1.2.16%2F%24injector%2Fnomod%3Fp0%3DuiComponent
s.dropdown%0A%20%20%20%20at%20http%3A%2F%2Flocalhost%3A9876%2Fabsolute%2FUsers%2
Fvanessa%2FDocuments%2FAngular%2Fangularjs-web-component-development-master%2Fli
b%2Fangular.min.js%3F5928dd77b163848ff945444a16c470a343b6f96b%3A20%0A%20%20%20%2
0at%20http%3A%2F%2Flocalhost%3A9876%2Fabsolute%2FUsers%2Fvanessa%2FDocuments%2FA
ngular%2Fangularjs-web-component-development-master%2Flib%2Fangular.min.js%3F592
8dd77b163848ff945444a16c470a343b6f96b%3A21%0A%20%20%20%20at%20http%3A%2F%2Flocal
host%3A9876%2Fabsolute%2FUsers%2Fvanessa%2FDocuments%2FAngular%2Fangularjs-web-c
omponent-development-master%2Flib%2Fangular.min.js%3F5928dd77b163848ff945444a16c
470a343b6f96b%3A33
at /Users/vanessa/Documents/Angular/angularjs-web-component-developm
ent-master/lib/angular.min.js:33
Error: [$injector:modulerr] http://errors.angularjs.org/1.2.16/$injector
/modulerr?p0=uiComponents.dropdown&p1=Error%3A%20%5B%24injector%3Anomod%5D%20htt
p%3A%2F%2Ferrors.angularjs.org%2F1.2.16%2F%24injector%2Fnomod%3Fp0%3DuiComponent
s.dropdown%0A%20%20%20%20at%20http%3A%2F%2Flocalhost%3A9876%2Fabsolute%2FUsers%2
Fvanessa%2FDocuments%2FAngular%2Fangularjs-web-component-development-master%2Fli
b%2Fangular.min.js%3F5928dd77b163848ff945444a16c470a343b6f96b%3A20%0A%20%20%20%2
0at%20http%3A%2F%2Flocalhost%3A9876%2Fabsolute%2FUsers%2Fvanessa%2FDocuments%2FA
ngular%2Fangularjs-web-component-development-master%2Flib%2Fangular.min.js%3F592
8dd77b163848ff945444a16c470a343b6f96b%3A21%0A%20%20%20%20at%20http%3A%2F%2Flocal
host%3A9876%2Fabsolute%2FUsers%2Fvanessa%2FDocuments%2FAngular%2Fangularjs-web-c
omponent-development-master%2Flib%2Fangular.min.js%3F5928dd77b163848ff945444a16c
470a343b6f96b%3A33
at /Users/vanessa/Documents/Angular/angularjs-web-component-developm
ent-master/lib/angular.min.js:33
TypeError: 'undefined' is not an object (evaluating 'haystack.indexOf')
at /Users/vanessa/Documents/Angular/angularjs-web-component-developm
ent-master/src/Dropdown/test/DropdownSpec.js:82
PhantomJS 1.9.8 (Mac OS X) My Dropdown component directive Dropdown Component ma
rkup API coverage should transclude the 2 menu item components (API) FAILED
Error: [$injector:modulerr] http://errors.angularjs.org/1.2.16/$injector
/modulerr?p0=uiComponents.dropdown&p1=Error%3A%20%5B%24injector%3Anomod%5D%20htt
p%3A%2F%2Ferrors.angularjs.org%2F1.2.16%2F%24injector%2Fnomod%3Fp0%3DuiComponent
s.dropdown%0A%20%20%20%20at%20http%3A%2F%2Flocalhost%3A9876%2Fabsolute%2FUsers%2
Fvanessa%2FDocuments%2FAngular%2Fangularjs-web-component-development-master%2Fli
b%2Fangular.min.js%3F5928dd77b163848ff945444a16c470a343b6f96b%3A20%0A%20%20%20%2
0at%20http%3A%2F%2Flocalhost%3A9876%2Fabsolute%2FUsers%2Fvanessa%2FDocuments%2FA
ngular%2Fangularjs-web-component-development-master%2Flib%2Fangular.min.js%3F592
8dd77b163848ff945444a16c470a343b6f96b%3A21%0A%20%20%20%20at%20http%3A%2F%2Flocal
host%3A9876%2Fabsolute%2FUsers%2Fvanessa%2FDocuments%2FAngular%2Fangularjs-web-c
omponent-development-master%2Flib%2Fangular.min.js%3F5928dd77b163848ff945444a16c
470a343b6f96b%3A33
at /Users/vanessa/Documents/Angular/angularjs-web-component-developm
ent-master/lib/angular.min.js:33
Error: [$injector:modulerr] http://errors.angularjs.org/1.2.16/$injector
/modulerr?p0=uiComponents.dropdown&p1=Error%3A%20%5B%24injector%3Anomod%5D%20htt
p%3A%2F%2Ferrors.angularjs.org%2F1.2.16%2F%24injector%2Fnomod%3Fp0%3DuiComponent
s.dropdown%0A%20%20%20%20at%20http%3A%2F%2Flocalhost%3A9876%2Fabsolute%2FUsers%2
Fvanessa%2FDocuments%2FAngular%2Fangularjs-web-component-development-master%2Fli
b%2Fangular.min.js%3F5928dd77b163848ff945444a16c470a343b6f96b%3A20%0A%20%20%20%2
0at%20http%3A%2F%2Flocalhost%3A9876%2Fabsolute%2FUsers%2Fvanessa%2FDocuments%2FA
ngular%2Fangularjs-web-component-development-master%2Flib%2Fangular.min.js%3F592
8dd77b163848ff945444a16c470a343b6f96b%3A21%0A%20%20%20%20at%20http%3A%2F%2Flocal
host%3A9876%2Fabsolute%2FUsers%2Fvanessa%2FDocuments%2FAngular%2Fangularjs-web-c
omponent-development-master%2Flib%2Fangular.min.js%3F5928dd77b163848ff945444a16c

470a343b6f96b%3A33
at /Users/vanessa/Documents/Angular/angularjs-web-component-developm
ent-master/lib/angular.min.js:33
TypeError: 'undefined' is not an object (evaluating '$element.find')
at /Users/vanessa/Documents/Angular/angularjs-web-component-developm
ent-master/src/Dropdown/test/DropdownSpec.js:86
PhantomJS 1.9.8 (Mac OS X) My Dropdown component directive Dropdown Component ma
rkup API coverage should toggle open state when clicked FAILED
Error: [$injector:modulerr] http://errors.angularjs.org/1.2.16/$injector
/modulerr?p0=uiComponents.dropdown&p1=Error%3A%20%5B%24injector%3Anomod%5D%20htt
p%3A%2F%2Ferrors.angularjs.org%2F1.2.16%2F%24injector%2Fnomod%3Fp0%3DuiComponent
s.dropdown%0A%20%20%20%20at%20http%3A%2F%2Flocalhost%3A9876%2Fabsolute%2FUsers%2
Fvanessa%2FDocuments%2FAngular%2Fangularjs-web-component-development-master%2Fli
b%2Fangular.min.js%3F5928dd77b163848ff945444a16c470a343b6f96b%3A20%0A%20%20%20%2
0at%20http%3A%2F%2Flocalhost%3A9876%2Fabsolute%2FUsers%2Fvanessa%2FDocuments%2FA
ngular%2Fangularjs-web-component-development-master%2Flib%2Fangular.min.js%3F592
8dd77b163848ff945444a16c470a343b6f96b%3A21%0A%20%20%20%20at%20http%3A%2F%2Flocal
host%3A9876%2Fabsolute%2FUsers%2Fvanessa%2FDocuments%2FAngular%2Fangularjs-web-c
omponent-development-master%2Flib%2Fangular.min.js%3F5928dd77b163848ff945444a16c
470a343b6f96b%3A33
at /Users/vanessa/Documents/Angular/angularjs-web-component-developm
ent-master/lib/angular.min.js:33
Error: [$injector:modulerr] http://errors.angularjs.org/1.2.16/$injector
/modulerr?p0=uiComponents.dropdown&p1=Error%3A%20%5B%24injector%3Anomod%5D%20htt
p%3A%2F%2Ferrors.angularjs.org%2F1.2.16%2F%24injector%2Fnomod%3Fp0%3DuiComponent
s.dropdown%0A%20%20%20%20at%20http%3A%2F%2Flocalhost%3A9876%2Fabsolute%2FUsers%2
Fvanessa%2FDocuments%2FAngular%2Fangularjs-web-component-development-master%2Fli
b%2Fangular.min.js%3F5928dd77b163848ff945444a16c470a343b6f96b%3A20%0A%20%20%20%2
0at%20http%3A%2F%2Flocalhost%3A9876%2Fabsolute%2FUsers%2Fvanessa%2FDocuments%2FA
ngular%2Fangularjs-web-component-development-master%2Flib%2Fangular.min.js%3F592
8dd77b163848ff945444a16c470a343b6f96b%3A21%0A%20%20%20%20at%20http%3A%2F%2Flocal
host%3A9876%2Fabsolute%2FUsers%2Fvanessa%2FDocuments%2FAngular%2Fangularjs-web-c
omponent-development-master%2Flib%2Fangular.min.js%3F5928dd77b163848ff945444a16c
470a343b6f96b%3A33
at /Users/vanessa/Documents/Angular/angularjs-web-component-developm
ent-master/lib/angular.min.js:33
spyOn could not find an object to spy upon for $emit()
PhantomJS 1.9.8 (Mac OS X) My Dropdown component directive Dropdown Component JS
ON API coverage should get its title text from the menu JSON obj key FAILED
Error: [$injector:modulerr] http://errors.angularjs.org/1.2.16/$injector
/modulerr?p0=uiComponents.dropdown&p1=Error%3A%20%5B%24injector%3Anomod%5D%20htt
p%3A%2F%2Ferrors.angularjs.org%2F1.2.16%2F%24injector%2Fnomod%3Fp0%3DuiComponent
s.dropdown%0A%20%20%20%20at%20http%3A%2F%2Flocalhost%3A9876%2Fabsolute%2FUsers%2
Fvanessa%2FDocuments%2FAngular%2Fangularjs-web-component-development-master%2Fli
b%2Fangular.min.js%3F5928dd77b163848ff945444a16c470a343b6f96b%3A20%0A%20%20%20%2
0at%20http%3A%2F%2Flocalhost%3A9876%2Fabsolute%2FUsers%2Fvanessa%2FDocuments%2FA
ngular%2Fangularjs-web-component-development-master%2Flib%2Fangular.min.js%3F592
8dd77b163848ff945444a16c470a343b6f96b%3A21%0A%20%20%20%20at%20http%3A%2F%2Flocal
host%3A9876%2Fabsolute%2FUsers%2Fvanessa%2FDocuments%2FAngular%2Fangularjs-web-c
omponent-development-master%2Flib%2Fangular.min.js%3F5928dd77b163848ff945444a16c
470a343b6f96b%3A33
at /Users/vanessa/Documents/Angular/angularjs-web-component-developm
ent-master/lib/angular.min.js:33
TypeError: 'undefined' is not an object (evaluating '$scope.$parent')
at /Users/vanessa/Documents/Angular/angularjs-web-component-developm
ent-master/src/Dropdown/test/DropdownSpec.js:109
TypeError: 'undefined' is not an object (evaluating 'scope.dropdownTitle
')
at /Users/vanessa/Documents/Angular/angularjs-web-component-developm
ent-master/src/Dropdown/test/DropdownSpec.js:115

PhantomJS 1.9.8 (Mac OS X) My Dropdown component directive Dropdown Component JS


ON API coverage should know that it is using JSON data for rendering FAILED
Error: [$injector:modulerr] http://errors.angularjs.org/1.2.16/$injector
/modulerr?p0=uiComponents.dropdown&p1=Error%3A%20%5B%24injector%3Anomod%5D%20htt
p%3A%2F%2Ferrors.angularjs.org%2F1.2.16%2F%24injector%2Fnomod%3Fp0%3DuiComponent
s.dropdown%0A%20%20%20%20at%20http%3A%2F%2Flocalhost%3A9876%2Fabsolute%2FUsers%2
Fvanessa%2FDocuments%2FAngular%2Fangularjs-web-component-development-master%2Fli
b%2Fangular.min.js%3F5928dd77b163848ff945444a16c470a343b6f96b%3A20%0A%20%20%20%2
0at%20http%3A%2F%2Flocalhost%3A9876%2Fabsolute%2FUsers%2Fvanessa%2FDocuments%2FA
ngular%2Fangularjs-web-component-development-master%2Flib%2Fangular.min.js%3F592
8dd77b163848ff945444a16c470a343b6f96b%3A21%0A%20%20%20%20at%20http%3A%2F%2Flocal
host%3A9876%2Fabsolute%2FUsers%2Fvanessa%2FDocuments%2FAngular%2Fangularjs-web-c
omponent-development-master%2Flib%2Fangular.min.js%3F5928dd77b163848ff945444a16c
470a343b6f96b%3A33
at /Users/vanessa/Documents/Angular/angularjs-web-component-developm
ent-master/lib/angular.min.js:33
TypeError: 'undefined' is not an object (evaluating '$scope.$parent')
at /Users/vanessa/Documents/Angular/angularjs-web-component-developm
ent-master/src/Dropdown/test/DropdownSpec.js:109
TypeError: 'undefined' is not an object (evaluating 'scope.jsonData')
at /Users/vanessa/Documents/Angular/angularjs-web-component-developm
ent-master/src/Dropdown/test/DropdownSpec.js:119
PhantomJS 1.9.8 (Mac OS X) My Dropdown component directive Dropdown Component JS
ON API coverage should render the correct number of menu items (4) FAILED
Error: [$injector:modulerr] http://errors.angularjs.org/1.2.16/$injector
/modulerr?p0=uiComponents.dropdown&p1=Error%3A%20%5B%24injector%3Anomod%5D%20htt
p%3A%2F%2Ferrors.angularjs.org%2F1.2.16%2F%24injector%2Fnomod%3Fp0%3DuiComponent
s.dropdown%0A%20%20%20%20at%20http%3A%2F%2Flocalhost%3A9876%2Fabsolute%2FUsers%2
Fvanessa%2FDocuments%2FAngular%2Fangularjs-web-component-development-master%2Fli
b%2Fangular.min.js%3F5928dd77b163848ff945444a16c470a343b6f96b%3A20%0A%20%20%20%2
0at%20http%3A%2F%2Flocalhost%3A9876%2Fabsolute%2FUsers%2Fvanessa%2FDocuments%2FA
ngular%2Fangularjs-web-component-development-master%2Flib%2Fangular.min.js%3F592
8dd77b163848ff945444a16c470a343b6f96b%3A21%0A%20%20%20%20at%20http%3A%2F%2Flocal
host%3A9876%2Fabsolute%2FUsers%2Fvanessa%2FDocuments%2FAngular%2Fangularjs-web-c
omponent-development-master%2Flib%2Fangular.min.js%3F5928dd77b163848ff945444a16c
470a343b6f96b%3A33
at /Users/vanessa/Documents/Angular/angularjs-web-component-developm
ent-master/lib/angular.min.js:33
TypeError: 'undefined' is not an object (evaluating '$scope.$parent')
at /Users/vanessa/Documents/Angular/angularjs-web-component-developm
ent-master/src/Dropdown/test/DropdownSpec.js:109
TypeError: 'undefined' is not an object (evaluating '$element.find')
at /Users/vanessa/Documents/Angular/angularjs-web-component-developm
ent-master/src/Dropdown/test/DropdownSpec.js:123
PhantomJS 1.9.8 (Mac OS X) My Dropdown component directive Dropdown Component JS
ON API coverage Dropdown Service methods should now have 2 registered dropdowns
FAILED
Error: [$injector:modulerr] http://errors.angularjs.org/1.2.16/$injector
/modulerr?p0=uiComponents.dropdown&p1=Error%3A%20%5B%24injector%3Anomod%5D%20htt
p%3A%2F%2Ferrors.angularjs.org%2F1.2.16%2F%24injector%2Fnomod%3Fp0%3DuiComponent
s.dropdown%0A%20%20%20%20at%20http%3A%2F%2Flocalhost%3A9876%2Fabsolute%2FUsers%2
Fvanessa%2FDocuments%2FAngular%2Fangularjs-web-component-development-master%2Fli
b%2Fangular.min.js%3F5928dd77b163848ff945444a16c470a343b6f96b%3A20%0A%20%20%20%2
0at%20http%3A%2F%2Flocalhost%3A9876%2Fabsolute%2FUsers%2Fvanessa%2FDocuments%2FA
ngular%2Fangularjs-web-component-development-master%2Flib%2Fangular.min.js%3F592
8dd77b163848ff945444a16c470a343b6f96b%3A21%0A%20%20%20%20at%20http%3A%2F%2Flocal
host%3A9876%2Fabsolute%2FUsers%2Fvanessa%2FDocuments%2FAngular%2Fangularjs-web-c
omponent-development-master%2Flib%2Fangular.min.js%3F5928dd77b163848ff945444a16c
470a343b6f96b%3A33
at /Users/vanessa/Documents/Angular/angularjs-web-component-developm

ent-master/lib/angular.min.js:33
TypeError: 'undefined' is not an object (evaluating '$scope.$parent')
at /Users/vanessa/Documents/Angular/angularjs-web-component-developm
ent-master/src/Dropdown/test/DropdownSpec.js:109
Error: [$injector:modulerr] http://errors.angularjs.org/1.2.16/$injector
/modulerr?p0=uiComponents.dropdown&p1=Error%3A%20%5B%24injector%3Anomod%5D%20htt
p%3A%2F%2Ferrors.angularjs.org%2F1.2.16%2F%24injector%2Fnomod%3Fp0%3DuiComponent
s.dropdown%0A%20%20%20%20at%20http%3A%2F%2Flocalhost%3A9876%2Fabsolute%2FUsers%2
Fvanessa%2FDocuments%2FAngular%2Fangularjs-web-component-development-master%2Fli
b%2Fangular.min.js%3F5928dd77b163848ff945444a16c470a343b6f96b%3A20%0A%20%20%20%2
0at%20http%3A%2F%2Flocalhost%3A9876%2Fabsolute%2FUsers%2Fvanessa%2FDocuments%2FA
ngular%2Fangularjs-web-component-development-master%2Flib%2Fangular.min.js%3F592
8dd77b163848ff945444a16c470a343b6f96b%3A21%0A%20%20%20%20at%20http%3A%2F%2Flocal
host%3A9876%2Fabsolute%2FUsers%2Fvanessa%2FDocuments%2FAngular%2Fangularjs-web-c
omponent-development-master%2Flib%2Fangular.min.js%3F5928dd77b163848ff945444a16c
470a343b6f96b%3A33
at /Users/vanessa/Documents/Angular/angularjs-web-component-developm
ent-master/lib/angular.min.js:33
TypeError: 'undefined' is not an object (evaluating '$_uicDropdownServic
e.getDropdowns')
at /Users/vanessa/Documents/Angular/angularjs-web-component-developm
ent-master/src/Dropdown/test/DropdownSpec.js:141
PhantomJS 1.9.8 (Mac OS X) My Dropdown component directive Dropdown Component JS
ON API coverage Dropdown Service methods should retrieve a dropdown by id FAILED
Error: [$injector:modulerr] http://errors.angularjs.org/1.2.16/$injector
/modulerr?p0=uiComponents.dropdown&p1=Error%3A%20%5B%24injector%3Anomod%5D%20htt
p%3A%2F%2Ferrors.angularjs.org%2F1.2.16%2F%24injector%2Fnomod%3Fp0%3DuiComponent
s.dropdown%0A%20%20%20%20at%20http%3A%2F%2Flocalhost%3A9876%2Fabsolute%2FUsers%2
Fvanessa%2FDocuments%2FAngular%2Fangularjs-web-component-development-master%2Fli
b%2Fangular.min.js%3F5928dd77b163848ff945444a16c470a343b6f96b%3A20%0A%20%20%20%2
0at%20http%3A%2F%2Flocalhost%3A9876%2Fabsolute%2FUsers%2Fvanessa%2FDocuments%2FA
ngular%2Fangularjs-web-component-development-master%2Flib%2Fangular.min.js%3F592
8dd77b163848ff945444a16c470a343b6f96b%3A21%0A%20%20%20%20at%20http%3A%2F%2Flocal
host%3A9876%2Fabsolute%2FUsers%2Fvanessa%2FDocuments%2FAngular%2Fangularjs-web-c
omponent-development-master%2Flib%2Fangular.min.js%3F5928dd77b163848ff945444a16c
470a343b6f96b%3A33
at /Users/vanessa/Documents/Angular/angularjs-web-component-developm
ent-master/lib/angular.min.js:33
TypeError: 'undefined' is not an object (evaluating '$scope.$parent')
at /Users/vanessa/Documents/Angular/angularjs-web-component-developm
ent-master/src/Dropdown/test/DropdownSpec.js:109
Error: [$injector:modulerr] http://errors.angularjs.org/1.2.16/$injector
/modulerr?p0=uiComponents.dropdown&p1=Error%3A%20%5B%24injector%3Anomod%5D%20htt
p%3A%2F%2Ferrors.angularjs.org%2F1.2.16%2F%24injector%2Fnomod%3Fp0%3DuiComponent
s.dropdown%0A%20%20%20%20at%20http%3A%2F%2Flocalhost%3A9876%2Fabsolute%2FUsers%2
Fvanessa%2FDocuments%2FAngular%2Fangularjs-web-component-development-master%2Fli
b%2Fangular.min.js%3F5928dd77b163848ff945444a16c470a343b6f96b%3A20%0A%20%20%20%2
0at%20http%3A%2F%2Flocalhost%3A9876%2Fabsolute%2FUsers%2Fvanessa%2FDocuments%2FA
ngular%2Fangularjs-web-component-development-master%2Flib%2Fangular.min.js%3F592
8dd77b163848ff945444a16c470a343b6f96b%3A21%0A%20%20%20%20at%20http%3A%2F%2Flocal
host%3A9876%2Fabsolute%2FUsers%2Fvanessa%2FDocuments%2FAngular%2Fangularjs-web-c
omponent-development-master%2Flib%2Fangular.min.js%3F5928dd77b163848ff945444a16c
470a343b6f96b%3A33
at /Users/vanessa/Documents/Angular/angularjs-web-component-developm
ent-master/lib/angular.min.js:33
TypeError: 'undefined' is not an object (evaluating '$_uicDropdownServic
e.getById')
at /Users/vanessa/Documents/Angular/angularjs-web-component-developm
ent-master/src/Dropdown/test/DropdownSpec.js:145
PhantomJS 1.9.8 (Mac OS X) My NavBar component directive NavBar component config

uration APIs configuration defauts should show all contents if API attribute "mi
nimal" is not true FAILED
Error: [$injector:modulerr] http://errors.angularjs.org/1.2.16/$injector
/modulerr?p0=uiComponents.navbar&p1=Error%3A%20%5B%24injector%3Anomod%5D%20http%
3A%2F%2Ferrors.angularjs.org%2F1.2.16%2F%24injector%2Fnomod%3Fp0%3DuiComponents.
navbar%0A%20%20%20%20at%20http%3A%2F%2Flocalhost%3A9876%2Fabsolute%2FUsers%2Fvan
essa%2FDocuments%2FAngular%2Fangularjs-web-component-development-master%2Flib%2F
angular.min.js%3F5928dd77b163848ff945444a16c470a343b6f96b%3A20%0A%20%20%20%20at%
20http%3A%2F%2Flocalhost%3A9876%2Fabsolute%2FUsers%2Fvanessa%2FDocuments%2FAngul
ar%2Fangularjs-web-component-development-master%2Flib%2Fangular.min.js%3F5928dd7
7b163848ff945444a16c470a343b6f96b%3A21%0A%20%20%20%20at%20http%3A%2F%2Flocalhost
%3A9876%2Fabsolute%2FUsers%2Fvanessa%2FDocuments%2FAngular%2Fangularjs-web-compo
nent-development-master%2Flib%2Fangular.min.js%3F5928dd77b163848ff945444a16c470a
343b6f96b%3A33
at /Users/vanessa/Documents/Angular/angularjs-web-component-developm
ent-master/lib/angular.min.js:33
Error: [$injector:modulerr] http://errors.angularjs.org/1.2.16/$injector
/modulerr?p0=uiComponents.navbar&p1=Error%3A%20%5B%24injector%3Anomod%5D%20http%
3A%2F%2Ferrors.angularjs.org%2F1.2.16%2F%24injector%2Fnomod%3Fp0%3DuiComponents.
navbar%0A%20%20%20%20at%20http%3A%2F%2Flocalhost%3A9876%2Fabsolute%2FUsers%2Fvan
essa%2FDocuments%2FAngular%2Fangularjs-web-component-development-master%2Flib%2F
angular.min.js%3F5928dd77b163848ff945444a16c470a343b6f96b%3A20%0A%20%20%20%20at%
20http%3A%2F%2Flocalhost%3A9876%2Fabsolute%2FUsers%2Fvanessa%2FDocuments%2FAngul
ar%2Fangularjs-web-component-development-master%2Flib%2Fangular.min.js%3F5928dd7
7b163848ff945444a16c470a343b6f96b%3A21%0A%20%20%20%20at%20http%3A%2F%2Flocalhost
%3A9876%2Fabsolute%2FUsers%2Fvanessa%2FDocuments%2FAngular%2Fangularjs-web-compo
nent-development-master%2Flib%2Fangular.min.js%3F5928dd77b163848ff945444a16c470a
343b6f96b%3A33
at /Users/vanessa/Documents/Angular/angularjs-web-component-developm
ent-master/lib/angular.min.js:33
TypeError: 'undefined' is not an object (evaluating '$element.find')
at /Users/vanessa/Documents/Angular/angularjs-web-component-developm
ent-master/src/Navbar/test/NavbarSpec.js:155
PhantomJS 1.9.8 (Mac OS X) My NavBar component directive NavBar component config
uration APIs configuration defauts should set the brand logo URL to the API attr
ibute "home-url" FAILED
Error: [$injector:modulerr] http://errors.angularjs.org/1.2.16/$injector
/modulerr?p0=uiComponents.navbar&p1=Error%3A%20%5B%24injector%3Anomod%5D%20http%
3A%2F%2Ferrors.angularjs.org%2F1.2.16%2F%24injector%2Fnomod%3Fp0%3DuiComponents.
navbar%0A%20%20%20%20at%20http%3A%2F%2Flocalhost%3A9876%2Fabsolute%2FUsers%2Fvan
essa%2FDocuments%2FAngular%2Fangularjs-web-component-development-master%2Flib%2F
angular.min.js%3F5928dd77b163848ff945444a16c470a343b6f96b%3A20%0A%20%20%20%20at%
20http%3A%2F%2Flocalhost%3A9876%2Fabsolute%2FUsers%2Fvanessa%2FDocuments%2FAngul
ar%2Fangularjs-web-component-development-master%2Flib%2Fangular.min.js%3F5928dd7
7b163848ff945444a16c470a343b6f96b%3A21%0A%20%20%20%20at%20http%3A%2F%2Flocalhost
%3A9876%2Fabsolute%2FUsers%2Fvanessa%2FDocuments%2FAngular%2Fangularjs-web-compo
nent-development-master%2Flib%2Fangular.min.js%3F5928dd77b163848ff945444a16c470a
343b6f96b%3A33
at /Users/vanessa/Documents/Angular/angularjs-web-component-developm
ent-master/lib/angular.min.js:33
Error: [$injector:modulerr] http://errors.angularjs.org/1.2.16/$injector
/modulerr?p0=uiComponents.navbar&p1=Error%3A%20%5B%24injector%3Anomod%5D%20http%
3A%2F%2Ferrors.angularjs.org%2F1.2.16%2F%24injector%2Fnomod%3Fp0%3DuiComponents.
navbar%0A%20%20%20%20at%20http%3A%2F%2Flocalhost%3A9876%2Fabsolute%2FUsers%2Fvan
essa%2FDocuments%2FAngular%2Fangularjs-web-component-development-master%2Flib%2F
angular.min.js%3F5928dd77b163848ff945444a16c470a343b6f96b%3A20%0A%20%20%20%20at%
20http%3A%2F%2Flocalhost%3A9876%2Fabsolute%2FUsers%2Fvanessa%2FDocuments%2FAngul
ar%2Fangularjs-web-component-development-master%2Flib%2Fangular.min.js%3F5928dd7
7b163848ff945444a16c470a343b6f96b%3A21%0A%20%20%20%20at%20http%3A%2F%2Flocalhost
%3A9876%2Fabsolute%2FUsers%2Fvanessa%2FDocuments%2FAngular%2Fangularjs-web-compo

nent-development-master%2Flib%2Fangular.min.js%3F5928dd77b163848ff945444a16c470a
343b6f96b%3A33
at /Users/vanessa/Documents/Angular/angularjs-web-component-developm
ent-master/lib/angular.min.js:33
TypeError: 'undefined' is not an object (evaluating '$element.find')
at /Users/vanessa/Documents/Angular/angularjs-web-component-developm
ent-master/src/Navbar/test/NavbarSpec.js:160
PhantomJS 1.9.8 (Mac OS X) My NavBar component directive NavBar component config
uration APIs configuration defauts should fix position the nav bar if API attrib
ute "sticky" is true FAILED
Error: [$injector:modulerr] http://errors.angularjs.org/1.2.16/$injector
/modulerr?p0=uiComponents.navbar&p1=Error%3A%20%5B%24injector%3Anomod%5D%20http%
3A%2F%2Ferrors.angularjs.org%2F1.2.16%2F%24injector%2Fnomod%3Fp0%3DuiComponents.
navbar%0A%20%20%20%20at%20http%3A%2F%2Flocalhost%3A9876%2Fabsolute%2FUsers%2Fvan
essa%2FDocuments%2FAngular%2Fangularjs-web-component-development-master%2Flib%2F
angular.min.js%3F5928dd77b163848ff945444a16c470a343b6f96b%3A20%0A%20%20%20%20at%
20http%3A%2F%2Flocalhost%3A9876%2Fabsolute%2FUsers%2Fvanessa%2FDocuments%2FAngul
ar%2Fangularjs-web-component-development-master%2Flib%2Fangular.min.js%3F5928dd7
7b163848ff945444a16c470a343b6f96b%3A21%0A%20%20%20%20at%20http%3A%2F%2Flocalhost
%3A9876%2Fabsolute%2FUsers%2Fvanessa%2FDocuments%2FAngular%2Fangularjs-web-compo
nent-development-master%2Flib%2Fangular.min.js%3F5928dd77b163848ff945444a16c470a
343b6f96b%3A33
at /Users/vanessa/Documents/Angular/angularjs-web-component-developm
ent-master/lib/angular.min.js:33
Error: [$injector:modulerr] http://errors.angularjs.org/1.2.16/$injector
/modulerr?p0=uiComponents.navbar&p1=Error%3A%20%5B%24injector%3Anomod%5D%20http%
3A%2F%2Ferrors.angularjs.org%2F1.2.16%2F%24injector%2Fnomod%3Fp0%3DuiComponents.
navbar%0A%20%20%20%20at%20http%3A%2F%2Flocalhost%3A9876%2Fabsolute%2FUsers%2Fvan
essa%2FDocuments%2FAngular%2Fangularjs-web-component-development-master%2Flib%2F
angular.min.js%3F5928dd77b163848ff945444a16c470a343b6f96b%3A20%0A%20%20%20%20at%
20http%3A%2F%2Flocalhost%3A9876%2Fabsolute%2FUsers%2Fvanessa%2FDocuments%2FAngul
ar%2Fangularjs-web-component-development-master%2Flib%2Fangular.min.js%3F5928dd7
7b163848ff945444a16c470a343b6f96b%3A21%0A%20%20%20%20at%20http%3A%2F%2Flocalhost
%3A9876%2Fabsolute%2FUsers%2Fvanessa%2FDocuments%2FAngular%2Fangularjs-web-compo
nent-development-master%2Flib%2Fangular.min.js%3F5928dd77b163848ff945444a16c470a
343b6f96b%3A33
at /Users/vanessa/Documents/Angular/angularjs-web-component-developm
ent-master/lib/angular.min.js:33
TypeError: 'undefined' is not an object (evaluating '$element.hasClass')
at /Users/vanessa/Documents/Angular/angularjs-web-component-developm
ent-master/src/Navbar/test/NavbarSpec.js:168
PhantomJS 1.9.8 (Mac OS X) My NavBar component directive NavBar component config
uration APIs configuration defauts should contain dropdowns and menu components
as inner html FAILED
Error: [$injector:modulerr] http://errors.angularjs.org/1.2.16/$injector
/modulerr?p0=uiComponents.navbar&p1=Error%3A%20%5B%24injector%3Anomod%5D%20http%
3A%2F%2Ferrors.angularjs.org%2F1.2.16%2F%24injector%2Fnomod%3Fp0%3DuiComponents.
navbar%0A%20%20%20%20at%20http%3A%2F%2Flocalhost%3A9876%2Fabsolute%2FUsers%2Fvan
essa%2FDocuments%2FAngular%2Fangularjs-web-component-development-master%2Flib%2F
angular.min.js%3F5928dd77b163848ff945444a16c470a343b6f96b%3A20%0A%20%20%20%20at%
20http%3A%2F%2Flocalhost%3A9876%2Fabsolute%2FUsers%2Fvanessa%2FDocuments%2FAngul
ar%2Fangularjs-web-component-development-master%2Flib%2Fangular.min.js%3F5928dd7
7b163848ff945444a16c470a343b6f96b%3A21%0A%20%20%20%20at%20http%3A%2F%2Flocalhost
%3A9876%2Fabsolute%2FUsers%2Fvanessa%2FDocuments%2FAngular%2Fangularjs-web-compo
nent-development-master%2Flib%2Fangular.min.js%3F5928dd77b163848ff945444a16c470a
343b6f96b%3A33
at /Users/vanessa/Documents/Angular/angularjs-web-component-developm
ent-master/lib/angular.min.js:33
Error: [$injector:modulerr] http://errors.angularjs.org/1.2.16/$injector
/modulerr?p0=uiComponents.navbar&p1=Error%3A%20%5B%24injector%3Anomod%5D%20http%

3A%2F%2Ferrors.angularjs.org%2F1.2.16%2F%24injector%2Fnomod%3Fp0%3DuiComponents.
navbar%0A%20%20%20%20at%20http%3A%2F%2Flocalhost%3A9876%2Fabsolute%2FUsers%2Fvan
essa%2FDocuments%2FAngular%2Fangularjs-web-component-development-master%2Flib%2F
angular.min.js%3F5928dd77b163848ff945444a16c470a343b6f96b%3A20%0A%20%20%20%20at%
20http%3A%2F%2Flocalhost%3A9876%2Fabsolute%2FUsers%2Fvanessa%2FDocuments%2FAngul
ar%2Fangularjs-web-component-development-master%2Flib%2Fangular.min.js%3F5928dd7
7b163848ff945444a16c470a343b6f96b%3A21%0A%20%20%20%20at%20http%3A%2F%2Flocalhost
%3A9876%2Fabsolute%2FUsers%2Fvanessa%2FDocuments%2FAngular%2Fangularjs-web-compo
nent-development-master%2Flib%2Fangular.min.js%3F5928dd77b163848ff945444a16c470a
343b6f96b%3A33
at /Users/vanessa/Documents/Angular/angularjs-web-component-developm
ent-master/lib/angular.min.js:33
TypeError: 'undefined' is not an object (evaluating '$element.find')
at /Users/vanessa/Documents/Angular/angularjs-web-component-developm
ent-master/src/Navbar/test/NavbarSpec.js:175
PhantomJS 1.9.8 (Mac OS X) My NavBar component directive NavBar component config
uration APIs configuration API alternatives should hide all contents if API attr
ibute "minimal" is true FAILED
Error: [$injector:modulerr] http://errors.angularjs.org/1.2.16/$injector
/modulerr?p0=uiComponents.navbar&p1=Error%3A%20%5B%24injector%3Anomod%5D%20http%
3A%2F%2Ferrors.angularjs.org%2F1.2.16%2F%24injector%2Fnomod%3Fp0%3DuiComponents.
navbar%0A%20%20%20%20at%20http%3A%2F%2Flocalhost%3A9876%2Fabsolute%2FUsers%2Fvan
essa%2FDocuments%2FAngular%2Fangularjs-web-component-development-master%2Flib%2F
angular.min.js%3F5928dd77b163848ff945444a16c470a343b6f96b%3A20%0A%20%20%20%20at%
20http%3A%2F%2Flocalhost%3A9876%2Fabsolute%2FUsers%2Fvanessa%2FDocuments%2FAngul
ar%2Fangularjs-web-component-development-master%2Flib%2Fangular.min.js%3F5928dd7
7b163848ff945444a16c470a343b6f96b%3A21%0A%20%20%20%20at%20http%3A%2F%2Flocalhost
%3A9876%2Fabsolute%2FUsers%2Fvanessa%2FDocuments%2FAngular%2Fangularjs-web-compo
nent-development-master%2Flib%2Fangular.min.js%3F5928dd77b163848ff945444a16c470a
343b6f96b%3A33
at /Users/vanessa/Documents/Angular/angularjs-web-component-developm
ent-master/lib/angular.min.js:33
Error: [$injector:modulerr] http://errors.angularjs.org/1.2.16/$injector
/modulerr?p0=uiComponents.navbar&p1=Error%3A%20%5B%24injector%3Anomod%5D%20http%
3A%2F%2Ferrors.angularjs.org%2F1.2.16%2F%24injector%2Fnomod%3Fp0%3DuiComponents.
navbar%0A%20%20%20%20at%20http%3A%2F%2Flocalhost%3A9876%2Fabsolute%2FUsers%2Fvan
essa%2FDocuments%2FAngular%2Fangularjs-web-component-development-master%2Flib%2F
angular.min.js%3F5928dd77b163848ff945444a16c470a343b6f96b%3A20%0A%20%20%20%20at%
20http%3A%2F%2Flocalhost%3A9876%2Fabsolute%2FUsers%2Fvanessa%2FDocuments%2FAngul
ar%2Fangularjs-web-component-development-master%2Flib%2Fangular.min.js%3F5928dd7
7b163848ff945444a16c470a343b6f96b%3A21%0A%20%20%20%20at%20http%3A%2F%2Flocalhost
%3A9876%2Fabsolute%2FUsers%2Fvanessa%2FDocuments%2FAngular%2Fangularjs-web-compo
nent-development-master%2Flib%2Fangular.min.js%3F5928dd77b163848ff945444a16c470a
343b6f96b%3A33
at /Users/vanessa/Documents/Angular/angularjs-web-component-developm
ent-master/lib/angular.min.js:33
TypeError: 'undefined' is not an object (evaluating '$element.find')
at /Users/vanessa/Documents/Angular/angularjs-web-component-developm
ent-master/src/Navbar/test/NavbarSpec.js:190
PhantomJS 1.9.8 (Mac OS X) My NavBar component directive NavBar component config
uration APIs configuration API alternatives should static position the navbar if
API attr "sticky" is falsy FAILED
Error: [$injector:modulerr] http://errors.angularjs.org/1.2.16/$injector
/modulerr?p0=uiComponents.navbar&p1=Error%3A%20%5B%24injector%3Anomod%5D%20http%
3A%2F%2Ferrors.angularjs.org%2F1.2.16%2F%24injector%2Fnomod%3Fp0%3DuiComponents.
navbar%0A%20%20%20%20at%20http%3A%2F%2Flocalhost%3A9876%2Fabsolute%2FUsers%2Fvan
essa%2FDocuments%2FAngular%2Fangularjs-web-component-development-master%2Flib%2F
angular.min.js%3F5928dd77b163848ff945444a16c470a343b6f96b%3A20%0A%20%20%20%20at%
20http%3A%2F%2Flocalhost%3A9876%2Fabsolute%2FUsers%2Fvanessa%2FDocuments%2FAngul
ar%2Fangularjs-web-component-development-master%2Flib%2Fangular.min.js%3F5928dd7

7b163848ff945444a16c470a343b6f96b%3A21%0A%20%20%20%20at%20http%3A%2F%2Flocalhost
%3A9876%2Fabsolute%2FUsers%2Fvanessa%2FDocuments%2FAngular%2Fangularjs-web-compo
nent-development-master%2Flib%2Fangular.min.js%3F5928dd77b163848ff945444a16c470a
343b6f96b%3A33
at /Users/vanessa/Documents/Angular/angularjs-web-component-developm
ent-master/lib/angular.min.js:33
Error: [$injector:modulerr] http://errors.angularjs.org/1.2.16/$injector
/modulerr?p0=uiComponents.navbar&p1=Error%3A%20%5B%24injector%3Anomod%5D%20http%
3A%2F%2Ferrors.angularjs.org%2F1.2.16%2F%24injector%2Fnomod%3Fp0%3DuiComponents.
navbar%0A%20%20%20%20at%20http%3A%2F%2Flocalhost%3A9876%2Fabsolute%2FUsers%2Fvan
essa%2FDocuments%2FAngular%2Fangularjs-web-component-development-master%2Flib%2F
angular.min.js%3F5928dd77b163848ff945444a16c470a343b6f96b%3A20%0A%20%20%20%20at%
20http%3A%2F%2Flocalhost%3A9876%2Fabsolute%2FUsers%2Fvanessa%2FDocuments%2FAngul
ar%2Fangularjs-web-component-development-master%2Flib%2Fangular.min.js%3F5928dd7
7b163848ff945444a16c470a343b6f96b%3A21%0A%20%20%20%20at%20http%3A%2F%2Flocalhost
%3A9876%2Fabsolute%2FUsers%2Fvanessa%2FDocuments%2FAngular%2Fangularjs-web-compo
nent-development-master%2Flib%2Fangular.min.js%3F5928dd77b163848ff945444a16c470a
343b6f96b%3A33
at /Users/vanessa/Documents/Angular/angularjs-web-component-developm
ent-master/lib/angular.min.js:33
TypeError: 'undefined' is not an object (evaluating '$element.hasClass')
at /Users/vanessa/Documents/Angular/angularjs-web-component-developm
ent-master/src/Navbar/test/NavbarSpec.js:197
PhantomJS 1.9.8 (Mac OS X) My NavBar component directive NavBar component config
uration APIs configuration API alternatives should add a style theme class if AP
I attr "theme" equals "classname" FAILED
Error: [$injector:modulerr] http://errors.angularjs.org/1.2.16/$injector
/modulerr?p0=uiComponents.navbar&p1=Error%3A%20%5B%24injector%3Anomod%5D%20http%
3A%2F%2Ferrors.angularjs.org%2F1.2.16%2F%24injector%2Fnomod%3Fp0%3DuiComponents.
navbar%0A%20%20%20%20at%20http%3A%2F%2Flocalhost%3A9876%2Fabsolute%2FUsers%2Fvan
essa%2FDocuments%2FAngular%2Fangularjs-web-component-development-master%2Flib%2F
angular.min.js%3F5928dd77b163848ff945444a16c470a343b6f96b%3A20%0A%20%20%20%20at%
20http%3A%2F%2Flocalhost%3A9876%2Fabsolute%2FUsers%2Fvanessa%2FDocuments%2FAngul
ar%2Fangularjs-web-component-development-master%2Flib%2Fangular.min.js%3F5928dd7
7b163848ff945444a16c470a343b6f96b%3A21%0A%20%20%20%20at%20http%3A%2F%2Flocalhost
%3A9876%2Fabsolute%2FUsers%2Fvanessa%2FDocuments%2FAngular%2Fangularjs-web-compo
nent-development-master%2Flib%2Fangular.min.js%3F5928dd77b163848ff945444a16c470a
343b6f96b%3A33
at /Users/vanessa/Documents/Angular/angularjs-web-component-developm
ent-master/lib/angular.min.js:33
Error: [$injector:modulerr] http://errors.angularjs.org/1.2.16/$injector
/modulerr?p0=uiComponents.navbar&p1=Error%3A%20%5B%24injector%3Anomod%5D%20http%
3A%2F%2Ferrors.angularjs.org%2F1.2.16%2F%24injector%2Fnomod%3Fp0%3DuiComponents.
navbar%0A%20%20%20%20at%20http%3A%2F%2Flocalhost%3A9876%2Fabsolute%2FUsers%2Fvan
essa%2FDocuments%2FAngular%2Fangularjs-web-component-development-master%2Flib%2F
angular.min.js%3F5928dd77b163848ff945444a16c470a343b6f96b%3A20%0A%20%20%20%20at%
20http%3A%2F%2Flocalhost%3A9876%2Fabsolute%2FUsers%2Fvanessa%2FDocuments%2FAngul
ar%2Fangularjs-web-component-development-master%2Flib%2Fangular.min.js%3F5928dd7
7b163848ff945444a16c470a343b6f96b%3A21%0A%20%20%20%20at%20http%3A%2F%2Flocalhost
%3A9876%2Fabsolute%2FUsers%2Fvanessa%2FDocuments%2FAngular%2Fangularjs-web-compo
nent-development-master%2Flib%2Fangular.min.js%3F5928dd77b163848ff945444a16c470a
343b6f96b%3A33
at /Users/vanessa/Documents/Angular/angularjs-web-component-developm
ent-master/lib/angular.min.js:33
TypeError: 'undefined' is not an object (evaluating '$element.hasClass')
at /Users/vanessa/Documents/Angular/angularjs-web-component-developm
ent-master/src/Navbar/test/NavbarSpec.js:205
PhantomJS 1.9.8 (Mac OS X) My NavBar component directive NavBar component config
uration APIs configuration API via JSON should contain dropdowns and menu compon
ents provided as JSON FAILED

Error: [$injector:modulerr] http://errors.angularjs.org/1.2.16/$injector


/modulerr?p0=uiComponents.navbar&p1=Error%3A%20%5B%24injector%3Anomod%5D%20http%
3A%2F%2Ferrors.angularjs.org%2F1.2.16%2F%24injector%2Fnomod%3Fp0%3DuiComponents.
navbar%0A%20%20%20%20at%20http%3A%2F%2Flocalhost%3A9876%2Fabsolute%2FUsers%2Fvan
essa%2FDocuments%2FAngular%2Fangularjs-web-component-development-master%2Flib%2F
angular.min.js%3F5928dd77b163848ff945444a16c470a343b6f96b%3A20%0A%20%20%20%20at%
20http%3A%2F%2Flocalhost%3A9876%2Fabsolute%2FUsers%2Fvanessa%2FDocuments%2FAngul
ar%2Fangularjs-web-component-development-master%2Flib%2Fangular.min.js%3F5928dd7
7b163848ff945444a16c470a343b6f96b%3A21%0A%20%20%20%20at%20http%3A%2F%2Flocalhost
%3A9876%2Fabsolute%2FUsers%2Fvanessa%2FDocuments%2FAngular%2Fangularjs-web-compo
nent-development-master%2Flib%2Fangular.min.js%3F5928dd77b163848ff945444a16c470a
343b6f96b%3A33
at /Users/vanessa/Documents/Angular/angularjs-web-component-developm
ent-master/lib/angular.min.js:33
Error: [$injector:modulerr] http://errors.angularjs.org/1.2.16/$injector
/modulerr?p0=uiComponents.navbar&p1=Error%3A%20%5B%24injector%3Anomod%5D%20http%
3A%2F%2Ferrors.angularjs.org%2F1.2.16%2F%24injector%2Fnomod%3Fp0%3DuiComponents.
navbar%0A%20%20%20%20at%20http%3A%2F%2Flocalhost%3A9876%2Fabsolute%2FUsers%2Fvan
essa%2FDocuments%2FAngular%2Fangularjs-web-component-development-master%2Flib%2F
angular.min.js%3F5928dd77b163848ff945444a16c470a343b6f96b%3A20%0A%20%20%20%20at%
20http%3A%2F%2Flocalhost%3A9876%2Fabsolute%2FUsers%2Fvanessa%2FDocuments%2FAngul
ar%2Fangularjs-web-component-development-master%2Flib%2Fangular.min.js%3F5928dd7
7b163848ff945444a16c470a343b6f96b%3A21%0A%20%20%20%20at%20http%3A%2F%2Flocalhost
%3A9876%2Fabsolute%2FUsers%2Fvanessa%2FDocuments%2FAngular%2Fangularjs-web-compo
nent-development-master%2Flib%2Fangular.min.js%3F5928dd77b163848ff945444a16c470a
343b6f96b%3A33
at /Users/vanessa/Documents/Angular/angularjs-web-component-developm
ent-master/lib/angular.min.js:33
TypeError: 'undefined' is not an object (evaluating '$element.find')
at /Users/vanessa/Documents/Angular/angularjs-web-component-developm
ent-master/src/Navbar/test/NavbarSpec.js:224
PhantomJS 1.9.8 (Mac OS X) My NavBar component directive Runtime event APIs shou
ld hide contents on "header-minimize" FAILED
Error: [$injector:modulerr] http://errors.angularjs.org/1.2.16/$injector
/modulerr?p0=uiComponents.navbar&p1=Error%3A%20%5B%24injector%3Anomod%5D%20http%
3A%2F%2Ferrors.angularjs.org%2F1.2.16%2F%24injector%2Fnomod%3Fp0%3DuiComponents.
navbar%0A%20%20%20%20at%20http%3A%2F%2Flocalhost%3A9876%2Fabsolute%2FUsers%2Fvan
essa%2FDocuments%2FAngular%2Fangularjs-web-component-development-master%2Flib%2F
angular.min.js%3F5928dd77b163848ff945444a16c470a343b6f96b%3A20%0A%20%20%20%20at%
20http%3A%2F%2Flocalhost%3A9876%2Fabsolute%2FUsers%2Fvanessa%2FDocuments%2FAngul
ar%2Fangularjs-web-component-development-master%2Flib%2Fangular.min.js%3F5928dd7
7b163848ff945444a16c470a343b6f96b%3A21%0A%20%20%20%20at%20http%3A%2F%2Flocalhost
%3A9876%2Fabsolute%2FUsers%2Fvanessa%2FDocuments%2FAngular%2Fangularjs-web-compo
nent-development-master%2Flib%2Fangular.min.js%3F5928dd77b163848ff945444a16c470a
343b6f96b%3A33
at /Users/vanessa/Documents/Angular/angularjs-web-component-developm
ent-master/lib/angular.min.js:33
Error: [$injector:modulerr] http://errors.angularjs.org/1.2.16/$injector
/modulerr?p0=uiComponents.navbar&p1=Error%3A%20%5B%24injector%3Anomod%5D%20http%
3A%2F%2Ferrors.angularjs.org%2F1.2.16%2F%24injector%2Fnomod%3Fp0%3DuiComponents.
navbar%0A%20%20%20%20at%20http%3A%2F%2Flocalhost%3A9876%2Fabsolute%2FUsers%2Fvan
essa%2FDocuments%2FAngular%2Fangularjs-web-component-development-master%2Flib%2F
angular.min.js%3F5928dd77b163848ff945444a16c470a343b6f96b%3A20%0A%20%20%20%20at%
20http%3A%2F%2Flocalhost%3A9876%2Fabsolute%2FUsers%2Fvanessa%2FDocuments%2FAngul
ar%2Fangularjs-web-component-development-master%2Flib%2Fangular.min.js%3F5928dd7
7b163848ff945444a16c470a343b6f96b%3A21%0A%20%20%20%20at%20http%3A%2F%2Flocalhost
%3A9876%2Fabsolute%2FUsers%2Fvanessa%2FDocuments%2FAngular%2Fangularjs-web-compo
nent-development-master%2Flib%2Fangular.min.js%3F5928dd77b163848ff945444a16c470a
343b6f96b%3A33
at /Users/vanessa/Documents/Angular/angularjs-web-component-developm

ent-master/lib/angular.min.js:33
TypeError: 'undefined' is not an object (evaluating '$element.find')
at /Users/vanessa/Documents/Angular/angularjs-web-component-developm
ent-master/src/Navbar/test/NavbarSpec.js:250
PhantomJS 1.9.8 (Mac OS X) My NavBar component directive Runtime event APIs shou
ld show contents on "header-maximize" FAILED
Error: [$injector:modulerr] http://errors.angularjs.org/1.2.16/$injector
/modulerr?p0=uiComponents.navbar&p1=Error%3A%20%5B%24injector%3Anomod%5D%20http%
3A%2F%2Ferrors.angularjs.org%2F1.2.16%2F%24injector%2Fnomod%3Fp0%3DuiComponents.
navbar%0A%20%20%20%20at%20http%3A%2F%2Flocalhost%3A9876%2Fabsolute%2FUsers%2Fvan
essa%2FDocuments%2FAngular%2Fangularjs-web-component-development-master%2Flib%2F
angular.min.js%3F5928dd77b163848ff945444a16c470a343b6f96b%3A20%0A%20%20%20%20at%
20http%3A%2F%2Flocalhost%3A9876%2Fabsolute%2FUsers%2Fvanessa%2FDocuments%2FAngul
ar%2Fangularjs-web-component-development-master%2Flib%2Fangular.min.js%3F5928dd7
7b163848ff945444a16c470a343b6f96b%3A21%0A%20%20%20%20at%20http%3A%2F%2Flocalhost
%3A9876%2Fabsolute%2FUsers%2Fvanessa%2FDocuments%2FAngular%2Fangularjs-web-compo
nent-development-master%2Flib%2Fangular.min.js%3F5928dd77b163848ff945444a16c470a
343b6f96b%3A33
at /Users/vanessa/Documents/Angular/angularjs-web-component-developm
ent-master/lib/angular.min.js:33
Error: [$injector:modulerr] http://errors.angularjs.org/1.2.16/$injector
/modulerr?p0=uiComponents.navbar&p1=Error%3A%20%5B%24injector%3Anomod%5D%20http%
3A%2F%2Ferrors.angularjs.org%2F1.2.16%2F%24injector%2Fnomod%3Fp0%3DuiComponents.
navbar%0A%20%20%20%20at%20http%3A%2F%2Flocalhost%3A9876%2Fabsolute%2FUsers%2Fvan
essa%2FDocuments%2FAngular%2Fangularjs-web-component-development-master%2Flib%2F
angular.min.js%3F5928dd77b163848ff945444a16c470a343b6f96b%3A20%0A%20%20%20%20at%
20http%3A%2F%2Flocalhost%3A9876%2Fabsolute%2FUsers%2Fvanessa%2FDocuments%2FAngul
ar%2Fangularjs-web-component-development-master%2Flib%2Fangular.min.js%3F5928dd7
7b163848ff945444a16c470a343b6f96b%3A21%0A%20%20%20%20at%20http%3A%2F%2Flocalhost
%3A9876%2Fabsolute%2FUsers%2Fvanessa%2FDocuments%2FAngular%2Fangularjs-web-compo
nent-development-master%2Flib%2Fangular.min.js%3F5928dd77b163848ff945444a16c470a
343b6f96b%3A33
at /Users/vanessa/Documents/Angular/angularjs-web-component-developm
ent-master/lib/angular.min.js:33
TypeError: 'undefined' is not an object (evaluating '$rootScope.$broadca
st')
at /Users/vanessa/Documents/Angular/angularjs-web-component-developm
ent-master/src/Navbar/test/NavbarSpec.js:262
PhantomJS 1.9.8 (Mac OS X) My NavBar component directive Runtime event APIs shou
ld add a dropdown on "add-nav-dropdowns" FAILED
Error: [$injector:modulerr] http://errors.angularjs.org/1.2.16/$injector
/modulerr?p0=uiComponents.navbar&p1=Error%3A%20%5B%24injector%3Anomod%5D%20http%
3A%2F%2Ferrors.angularjs.org%2F1.2.16%2F%24injector%2Fnomod%3Fp0%3DuiComponents.
navbar%0A%20%20%20%20at%20http%3A%2F%2Flocalhost%3A9876%2Fabsolute%2FUsers%2Fvan
essa%2FDocuments%2FAngular%2Fangularjs-web-component-development-master%2Flib%2F
angular.min.js%3F5928dd77b163848ff945444a16c470a343b6f96b%3A20%0A%20%20%20%20at%
20http%3A%2F%2Flocalhost%3A9876%2Fabsolute%2FUsers%2Fvanessa%2FDocuments%2FAngul
ar%2Fangularjs-web-component-development-master%2Flib%2Fangular.min.js%3F5928dd7
7b163848ff945444a16c470a343b6f96b%3A21%0A%20%20%20%20at%20http%3A%2F%2Flocalhost
%3A9876%2Fabsolute%2FUsers%2Fvanessa%2FDocuments%2FAngular%2Fangularjs-web-compo
nent-development-master%2Flib%2Fangular.min.js%3F5928dd77b163848ff945444a16c470a
343b6f96b%3A33
at /Users/vanessa/Documents/Angular/angularjs-web-component-developm
ent-master/lib/angular.min.js:33
Error: [$injector:modulerr] http://errors.angularjs.org/1.2.16/$injector
/modulerr?p0=uiComponents.navbar&p1=Error%3A%20%5B%24injector%3Anomod%5D%20http%
3A%2F%2Ferrors.angularjs.org%2F1.2.16%2F%24injector%2Fnomod%3Fp0%3DuiComponents.
navbar%0A%20%20%20%20at%20http%3A%2F%2Flocalhost%3A9876%2Fabsolute%2FUsers%2Fvan
essa%2FDocuments%2FAngular%2Fangularjs-web-component-development-master%2Flib%2F
angular.min.js%3F5928dd77b163848ff945444a16c470a343b6f96b%3A20%0A%20%20%20%20at%

20http%3A%2F%2Flocalhost%3A9876%2Fabsolute%2FUsers%2Fvanessa%2FDocuments%2FAngul
ar%2Fangularjs-web-component-development-master%2Flib%2Fangular.min.js%3F5928dd7
7b163848ff945444a16c470a343b6f96b%3A21%0A%20%20%20%20at%20http%3A%2F%2Flocalhost
%3A9876%2Fabsolute%2FUsers%2Fvanessa%2FDocuments%2FAngular%2Fangularjs-web-compo
nent-development-master%2Flib%2Fangular.min.js%3F5928dd77b163848ff945444a16c470a
343b6f96b%3A33
at /Users/vanessa/Documents/Angular/angularjs-web-component-developm
ent-master/lib/angular.min.js:33
TypeError: 'undefined' is not an object (evaluating '$element.find')
at /Users/vanessa/Documents/Angular/angularjs-web-component-developm
ent-master/src/Navbar/test/NavbarSpec.js:278
PhantomJS 1.9.8 (Mac OS X) My NavBar component directive Runtime event APIs shou
ld remove a dropdown on "remove-nav-dropdowns" FAILED
Error: [$injector:modulerr] http://errors.angularjs.org/1.2.16/$injector
/modulerr?p0=uiComponents.navbar&p1=Error%3A%20%5B%24injector%3Anomod%5D%20http%
3A%2F%2Ferrors.angularjs.org%2F1.2.16%2F%24injector%2Fnomod%3Fp0%3DuiComponents.
navbar%0A%20%20%20%20at%20http%3A%2F%2Flocalhost%3A9876%2Fabsolute%2FUsers%2Fvan
essa%2FDocuments%2FAngular%2Fangularjs-web-component-development-master%2Flib%2F
angular.min.js%3F5928dd77b163848ff945444a16c470a343b6f96b%3A20%0A%20%20%20%20at%
20http%3A%2F%2Flocalhost%3A9876%2Fabsolute%2FUsers%2Fvanessa%2FDocuments%2FAngul
ar%2Fangularjs-web-component-development-master%2Flib%2Fangular.min.js%3F5928dd7
7b163848ff945444a16c470a343b6f96b%3A21%0A%20%20%20%20at%20http%3A%2F%2Flocalhost
%3A9876%2Fabsolute%2FUsers%2Fvanessa%2FDocuments%2FAngular%2Fangularjs-web-compo
nent-development-master%2Flib%2Fangular.min.js%3F5928dd77b163848ff945444a16c470a
343b6f96b%3A33
at /Users/vanessa/Documents/Angular/angularjs-web-component-developm
ent-master/lib/angular.min.js:33
Error: [$injector:modulerr] http://errors.angularjs.org/1.2.16/$injector
/modulerr?p0=uiComponents.navbar&p1=Error%3A%20%5B%24injector%3Anomod%5D%20http%
3A%2F%2Ferrors.angularjs.org%2F1.2.16%2F%24injector%2Fnomod%3Fp0%3DuiComponents.
navbar%0A%20%20%20%20at%20http%3A%2F%2Flocalhost%3A9876%2Fabsolute%2FUsers%2Fvan
essa%2FDocuments%2FAngular%2Fangularjs-web-component-development-master%2Flib%2F
angular.min.js%3F5928dd77b163848ff945444a16c470a343b6f96b%3A20%0A%20%20%20%20at%
20http%3A%2F%2Flocalhost%3A9876%2Fabsolute%2FUsers%2Fvanessa%2FDocuments%2FAngul
ar%2Fangularjs-web-component-development-master%2Flib%2Fangular.min.js%3F5928dd7
7b163848ff945444a16c470a343b6f96b%3A21%0A%20%20%20%20at%20http%3A%2F%2Flocalhost
%3A9876%2Fabsolute%2FUsers%2Fvanessa%2FDocuments%2FAngular%2Fangularjs-web-compo
nent-development-master%2Flib%2Fangular.min.js%3F5928dd77b163848ff945444a16c470a
343b6f96b%3A33
at /Users/vanessa/Documents/Angular/angularjs-web-component-developm
ent-master/lib/angular.min.js:33
TypeError: 'undefined' is not an object (evaluating '$element.find')
at /Users/vanessa/Documents/Angular/angularjs-web-component-developm
ent-master/src/Navbar/test/NavbarSpec.js:294
PhantomJS 1.9.8 (Mac OS X) My NavBar component directive Runtime event APIs shou
ld log dropdown-opened on "dropdown-opened" FAILED
Error: [$injector:modulerr] http://errors.angularjs.org/1.2.16/$injector
/modulerr?p0=uiComponents.navbar&p1=Error%3A%20%5B%24injector%3Anomod%5D%20http%
3A%2F%2Ferrors.angularjs.org%2F1.2.16%2F%24injector%2Fnomod%3Fp0%3DuiComponents.
navbar%0A%20%20%20%20at%20http%3A%2F%2Flocalhost%3A9876%2Fabsolute%2FUsers%2Fvan
essa%2FDocuments%2FAngular%2Fangularjs-web-component-development-master%2Flib%2F
angular.min.js%3F5928dd77b163848ff945444a16c470a343b6f96b%3A20%0A%20%20%20%20at%
20http%3A%2F%2Flocalhost%3A9876%2Fabsolute%2FUsers%2Fvanessa%2FDocuments%2FAngul
ar%2Fangularjs-web-component-development-master%2Flib%2Fangular.min.js%3F5928dd7
7b163848ff945444a16c470a343b6f96b%3A21%0A%20%20%20%20at%20http%3A%2F%2Flocalhost
%3A9876%2Fabsolute%2FUsers%2Fvanessa%2FDocuments%2FAngular%2Fangularjs-web-compo
nent-development-master%2Flib%2Fangular.min.js%3F5928dd77b163848ff945444a16c470a
343b6f96b%3A33
at /Users/vanessa/Documents/Angular/angularjs-web-component-developm
ent-master/lib/angular.min.js:33

Error: [$injector:modulerr] http://errors.angularjs.org/1.2.16/$injector


/modulerr?p0=uiComponents.navbar&p1=Error%3A%20%5B%24injector%3Anomod%5D%20http%
3A%2F%2Ferrors.angularjs.org%2F1.2.16%2F%24injector%2Fnomod%3Fp0%3DuiComponents.
navbar%0A%20%20%20%20at%20http%3A%2F%2Flocalhost%3A9876%2Fabsolute%2FUsers%2Fvan
essa%2FDocuments%2FAngular%2Fangularjs-web-component-development-master%2Flib%2F
angular.min.js%3F5928dd77b163848ff945444a16c470a343b6f96b%3A20%0A%20%20%20%20at%
20http%3A%2F%2Flocalhost%3A9876%2Fabsolute%2FUsers%2Fvanessa%2FDocuments%2FAngul
ar%2Fangularjs-web-component-development-master%2Flib%2Fangular.min.js%3F5928dd7
7b163848ff945444a16c470a343b6f96b%3A21%0A%20%20%20%20at%20http%3A%2F%2Flocalhost
%3A9876%2Fabsolute%2FUsers%2Fvanessa%2FDocuments%2FAngular%2Fangularjs-web-compo
nent-development-master%2Flib%2Fangular.min.js%3F5928dd77b163848ff945444a16c470a
343b6f96b%3A33
at /Users/vanessa/Documents/Angular/angularjs-web-component-developm
ent-master/lib/angular.min.js:33
spyOn could not find an object to spy upon for log()
PhantomJS 1.9.8 (Mac OS X) My NavBar component directive Runtime event APIs shou
ld log dropdown-closed on "dropdown-closed" FAILED
Error: [$injector:modulerr] http://errors.angularjs.org/1.2.16/$injector
/modulerr?p0=uiComponents.navbar&p1=Error%3A%20%5B%24injector%3Anomod%5D%20http%
3A%2F%2Ferrors.angularjs.org%2F1.2.16%2F%24injector%2Fnomod%3Fp0%3DuiComponents.
navbar%0A%20%20%20%20at%20http%3A%2F%2Flocalhost%3A9876%2Fabsolute%2FUsers%2Fvan
essa%2FDocuments%2FAngular%2Fangularjs-web-component-development-master%2Flib%2F
angular.min.js%3F5928dd77b163848ff945444a16c470a343b6f96b%3A20%0A%20%20%20%20at%
20http%3A%2F%2Flocalhost%3A9876%2Fabsolute%2FUsers%2Fvanessa%2FDocuments%2FAngul
ar%2Fangularjs-web-component-development-master%2Flib%2Fangular.min.js%3F5928dd7
7b163848ff945444a16c470a343b6f96b%3A21%0A%20%20%20%20at%20http%3A%2F%2Flocalhost
%3A9876%2Fabsolute%2FUsers%2Fvanessa%2FDocuments%2FAngular%2Fangularjs-web-compo
nent-development-master%2Flib%2Fangular.min.js%3F5928dd77b163848ff945444a16c470a
343b6f96b%3A33
at /Users/vanessa/Documents/Angular/angularjs-web-component-developm
ent-master/lib/angular.min.js:33
Error: [$injector:modulerr] http://errors.angularjs.org/1.2.16/$injector
/modulerr?p0=uiComponents.navbar&p1=Error%3A%20%5B%24injector%3Anomod%5D%20http%
3A%2F%2Ferrors.angularjs.org%2F1.2.16%2F%24injector%2Fnomod%3Fp0%3DuiComponents.
navbar%0A%20%20%20%20at%20http%3A%2F%2Flocalhost%3A9876%2Fabsolute%2FUsers%2Fvan
essa%2FDocuments%2FAngular%2Fangularjs-web-component-development-master%2Flib%2F
angular.min.js%3F5928dd77b163848ff945444a16c470a343b6f96b%3A20%0A%20%20%20%20at%
20http%3A%2F%2Flocalhost%3A9876%2Fabsolute%2FUsers%2Fvanessa%2FDocuments%2FAngul
ar%2Fangularjs-web-component-development-master%2Flib%2Fangular.min.js%3F5928dd7
7b163848ff945444a16c470a343b6f96b%3A21%0A%20%20%20%20at%20http%3A%2F%2Flocalhost
%3A9876%2Fabsolute%2FUsers%2Fvanessa%2FDocuments%2FAngular%2Fangularjs-web-compo
nent-development-master%2Flib%2Fangular.min.js%3F5928dd77b163848ff945444a16c470a
343b6f96b%3A33
at /Users/vanessa/Documents/Angular/angularjs-web-component-developm
ent-master/lib/angular.min.js:33
spyOn could not find an object to spy upon for log()
PhantomJS 1.9.8 (Mac OS X) My NavBar component directive Runtime event APIs shou
ld log the URL on "menu-item-selected" FAILED
Error: [$injector:modulerr] http://errors.angularjs.org/1.2.16/$injector
/modulerr?p0=uiComponents.navbar&p1=Error%3A%20%5B%24injector%3Anomod%5D%20http%
3A%2F%2Ferrors.angularjs.org%2F1.2.16%2F%24injector%2Fnomod%3Fp0%3DuiComponents.
navbar%0A%20%20%20%20at%20http%3A%2F%2Flocalhost%3A9876%2Fabsolute%2FUsers%2Fvan
essa%2FDocuments%2FAngular%2Fangularjs-web-component-development-master%2Flib%2F
angular.min.js%3F5928dd77b163848ff945444a16c470a343b6f96b%3A20%0A%20%20%20%20at%
20http%3A%2F%2Flocalhost%3A9876%2Fabsolute%2FUsers%2Fvanessa%2FDocuments%2FAngul
ar%2Fangularjs-web-component-development-master%2Flib%2Fangular.min.js%3F5928dd7
7b163848ff945444a16c470a343b6f96b%3A21%0A%20%20%20%20at%20http%3A%2F%2Flocalhost
%3A9876%2Fabsolute%2FUsers%2Fvanessa%2FDocuments%2FAngular%2Fangularjs-web-compo
nent-development-master%2Flib%2Fangular.min.js%3F5928dd77b163848ff945444a16c470a
343b6f96b%3A33

at /Users/vanessa/Documents/Angular/angularjs-web-component-developm
ent-master/lib/angular.min.js:33
Error: [$injector:modulerr] http://errors.angularjs.org/1.2.16/$injector
/modulerr?p0=uiComponents.navbar&p1=Error%3A%20%5B%24injector%3Anomod%5D%20http%
3A%2F%2Ferrors.angularjs.org%2F1.2.16%2F%24injector%2Fnomod%3Fp0%3DuiComponents.
navbar%0A%20%20%20%20at%20http%3A%2F%2Flocalhost%3A9876%2Fabsolute%2FUsers%2Fvan
essa%2FDocuments%2FAngular%2Fangularjs-web-component-development-master%2Flib%2F
angular.min.js%3F5928dd77b163848ff945444a16c470a343b6f96b%3A20%0A%20%20%20%20at%
20http%3A%2F%2Flocalhost%3A9876%2Fabsolute%2FUsers%2Fvanessa%2FDocuments%2FAngul
ar%2Fangularjs-web-component-development-master%2Flib%2Fangular.min.js%3F5928dd7
7b163848ff945444a16c470a343b6f96b%3A21%0A%20%20%20%20at%20http%3A%2F%2Flocalhost
%3A9876%2Fabsolute%2FUsers%2Fvanessa%2FDocuments%2FAngular%2Fangularjs-web-compo
nent-development-master%2Flib%2Fangular.min.js%3F5928dd77b163848ff945444a16c470a
343b6f96b%3A33
at /Users/vanessa/Documents/Angular/angularjs-web-component-developm
ent-master/lib/angular.min.js:33
spyOn could not find an object to spy upon for log()
PhantomJS 1.9.8 (Mac OS X): Executed 33 of 33 (33 FAILED) ERROR (0.008 secs / 0.
043 secs)
Warning: Task "karma:unit" failed. Use --force to continue.
Aborted due to warnings.